[binutils-gdb] x86: Don't remove empty GNU_PROPERTY_X86_UINT32_OR_AND properties

classic Classic list List threaded Threaded
12 messages Options
Reply | Threaded
Open this post in threaded view
|

[binutils-gdb] x86: Don't remove empty GNU_PROPERTY_X86_UINT32_OR_AND properties

sergiodj+buildbot-2
*** TEST RESULTS FOR COMMIT fde51dd189a1f8a63896bcb845ef36ea5e1917d5 ***

Author: H.J. Lu <[hidden email]>
Branch: master
Commit: fde51dd189a1f8a63896bcb845ef36ea5e1917d5

x86: Don't remove empty GNU_PROPERTY_X86_UINT32_OR_AND properties

For GNU_PROPERTY_X86_COMPAT_ISA_1_USED and GNU_PROPERTY_X86_UINT32_OR_AND
properties, a bit in the output pr_data field is set if it is set in any
relocatable input pr_data fields and this property is present in all
relocatable input files.  A missing property implies that its bits have
unknown values.  When all bits in the the output pr_data field are zero,
this property should not be removed from output to indicate it has zero
in all bits.

bfd/

        PR ld/23372
        * elfxx-x86.c (_bfd_x86_elf_merge_gnu_properties): Don't remove
        empty properties for GNU_PROPERTY_X86_COMPAT_ISA_1_USED and
        GNU_PROPERTY_X86_UINT32_OR_AND.
        (_bfd_x86_elf_link_fixup_gnu_properties): Likewise.

ld/

        PR ld/23372
        * testsuite/ld-i386/pr23372a.d: Updated.
        * testsuite/ld-i386/pr23372c.d: Likewise.
        * testsuite/ld-x86-64/pr23372a-x32.d: Likewise.
        * testsuite/ld-x86-64/pr23372a.d: Likewise.
        * testsuite/ld-x86-64/pr23372c-x32.d: Likewise.
        * testsuite/ld-x86-64/pr23372c.d: Likewise.
Reply | Threaded
Open this post in threaded view
|

*** COMPILATION FAILED *** Failures on Ubuntu-Aarch64-native-extended-gdbserver-m64, branch master *** BREAKAGE ***

sergiodj+buildbot-2
Buildslave:
        ubuntu16-aarch64

Full Build URL:
        <http://gdb-build.sergiodj.net/builders/Ubuntu-Aarch64-native-extended-gdbserver-m64/builds/235>

Commit(s) tested:
        fde51dd189a1f8a63896bcb845ef36ea5e1917d5

Author(s) (in the same order as the commits):
        H.J. Lu <[hidden email]>

Subject:
        x86: Don't remove empty GNU_PROPERTY_X86_UINT32_OR_AND properties

Testsuite log (gdb.sum and gdb.log) URL(s):
        <http://gdb-build.sergiodj.net/results/Ubuntu-Aarch64-native-extended-gdbserver-m64/fd/fde51dd189a1f8a63896bcb845ef36ea5e1917d5/>

*** Failed to compiled GDB.  ***
============================

+++ The full log is too big to be posted here.
+++ These are the last 100 lines of it.

if [ x"" != x ]; then \
  gcc -c -DHAVE_CONFIG_H -g -D_GLIBCXX_DEBUG   -I. -I../../../../binutils-gdb/gdb/gdbserver/../../libiberty/../include  -W -Wall -Wwrite-strings -Wc++-compat -Wstrict-prototypes -pedantic  -D_GNU_SOURCE  ../../../../binutils-gdb/gdb/gdbserver/../../libiberty/xstrerror.c -o pic/xstrerror.o; \
else true; fi
gcc -c -DHAVE_CONFIG_H -g -D_GLIBCXX_DEBUG   -I. -I../../../../binutils-gdb/gdb/gdbserver/../../libiberty/../include  -W -Wall -Wwrite-strings -Wc++-compat -Wstrict-prototypes -pedantic  -D_GNU_SOURCE ../../../../binutils-gdb/gdb/gdbserver/../../libiberty/xstrdup.c -o xstrdup.o
if [ x"" != x ]; then \
  gcc -c -DHAVE_CONFIG_H -g -D_GLIBCXX_DEBUG   -I. -I../../../../binutils-gdb/gdb/gdbserver/../../libiberty/../include  -W -Wall -Wwrite-strings -Wc++-compat -Wstrict-prototypes -pedantic  -D_GNU_SOURCE   ../../../../binutils-gdb/gdb/gdbserver/../../libiberty/xstrerror.c -o noasan/xstrerror.o; \
else true; fi
if [ x"" != x ]; then \
  gcc -c -DHAVE_CONFIG_H -g -D_GLIBCXX_DEBUG   -I. -I../../../../binutils-gdb/gdb/gdbserver/../../libiberty/../include  -W -Wall -Wwrite-strings -Wc++-compat -Wstrict-prototypes -pedantic  -D_GNU_SOURCE  ../../../../binutils-gdb/gdb/gdbserver/../../libiberty/xstrndup.c -o pic/xstrndup.o; \
else true; fi
gcc -c -DHAVE_CONFIG_H -g -D_GLIBCXX_DEBUG   -I. -I../../../../binutils-gdb/gdb/gdbserver/../../libiberty/../include  -W -Wall -Wwrite-strings -Wc++-compat -Wstrict-prototypes -pedantic  -D_GNU_SOURCE ../../../../binutils-gdb/gdb/gdbserver/../../libiberty/xstrerror.c -o xstrerror.o
if [ x"" != x ]; then \
  gcc -c -DHAVE_CONFIG_H -g -D_GLIBCXX_DEBUG   -I. -I../../../../binutils-gdb/gdb/gdbserver/../../libiberty/../include  -W -Wall -Wwrite-strings -Wc++-compat -Wstrict-prototypes -pedantic  -D_GNU_SOURCE  ../../../../binutils-gdb/gdb/gdbserver/../../libiberty/xvasprintf.c -o pic/xvasprintf.o; \
else true; fi
if [ x"" != x ]; then \
  gcc -c -DHAVE_CONFIG_H -g -D_GLIBCXX_DEBUG   -I. -I../../../../binutils-gdb/gdb/gdbserver/../../libiberty/../include  -W -Wall -Wwrite-strings -Wc++-compat -Wstrict-prototypes -pedantic  -D_GNU_SOURCE   ../../../../binutils-gdb/gdb/gdbserver/../../libiberty/xstrndup.c -o noasan/xstrndup.o; \
else true; fi
if [ x"" != x ]; then \
  gcc -c -DHAVE_CONFIG_H -g -D_GLIBCXX_DEBUG   -I. -I../../../../binutils-gdb/gdb/gdbserver/../../libiberty/../include  -W -Wall -Wwrite-strings -Wc++-compat -Wstrict-prototypes -pedantic  -D_GNU_SOURCE   ../../../../binutils-gdb/gdb/gdbserver/../../libiberty/xvasprintf.c -o noasan/xvasprintf.o; \
else true; fi
gcc -c -DHAVE_CONFIG_H -g -D_GLIBCXX_DEBUG   -I. -I../../../../binutils-gdb/gdb/gdbserver/../../libiberty/../include  -W -Wall -Wwrite-strings -Wc++-compat -Wstrict-prototypes -pedantic  -D_GNU_SOURCE ../../../../binutils-gdb/gdb/gdbserver/../../libiberty/xstrndup.c -o xstrndup.o
if [ x"" != x ]; then \
  gcc -c -DHAVE_CONFIG_H -g -D_GLIBCXX_DEBUG   -I. -I../../../../binutils-gdb/gdb/gdbserver/../../libiberty/../include  -W -Wall -Wwrite-strings -Wc++-compat -Wstrict-prototypes -pedantic  -D_GNU_SOURCE  ../../../../binutils-gdb/gdb/gdbserver/../../libiberty/setproctitle.c -o pic/setproctitle.o; \
else true; fi
gcc -c -DHAVE_CONFIG_H -g -D_GLIBCXX_DEBUG   -I. -I../../../../binutils-gdb/gdb/gdbserver/../../libiberty/../include  -W -Wall -Wwrite-strings -Wc++-compat -Wstrict-prototypes -pedantic  -D_GNU_SOURCE ../../../../binutils-gdb/gdb/gdbserver/../../libiberty/xvasprintf.c -o xvasprintf.o
if [ x"" != x ]; then \
  gcc -c -DHAVE_CONFIG_H -g -D_GLIBCXX_DEBUG   -I. -I../../../../binutils-gdb/gdb/gdbserver/../../libiberty/../include  -W -Wall -Wwrite-strings -Wc++-compat -Wstrict-prototypes -pedantic  -D_GNU_SOURCE   ../../../../binutils-gdb/gdb/gdbserver/../../libiberty/setproctitle.c -o noasan/setproctitle.o; \
else true; fi
gcc -c -DHAVE_CONFIG_H -g -D_GLIBCXX_DEBUG   -I. -I../../../../binutils-gdb/gdb/gdbserver/../../libiberty/../include  -W -Wall -Wwrite-strings -Wc++-compat -Wstrict-prototypes -pedantic  -D_GNU_SOURCE ../../../../binutils-gdb/gdb/gdbserver/../../libiberty/setproctitle.c -o setproctitle.o
rm -f ./libiberty.a pic/./libiberty.a noasan/./libiberty.a
ar rc ./libiberty.a \
  ./regex.o ./cplus-dem.o ./cp-demangle.o ./md5.o ./sha1.o ./alloca.o ./argv.o ./choose-temp.o ./concat.o ./cp-demint.o ./crc32.o ./d-demangle.o ./dwarfnames.o ./dyn-string.o ./fdmatch.o ./fibheap.o ./filename_cmp.o ./floatformat.o ./fnmatch.o ./fopen_unlocked.o ./getopt.o ./getopt1.o ./getpwd.o ./getruntime.o ./hashtab.o ./hex.o ./lbasename.o ./lrealpath.o ./make-relative-prefix.o ./make-temp-file.o ./objalloc.o ./obstack.o ./partition.o ./pexecute.o ./physmem.o ./pex-common.o ./pex-one.o ./pex-unix.o ./vprintf-support.o ./rust-demangle.o ./safe-ctype.o ./simple-object.o ./simple-object-coff.o ./simple-object-elf.o ./simple-object-mach-o.o ./simple-object-xcoff.o ./sort.o ./spaces.o ./splay-tree.o ./stack-limit.o ./strerror.o ./strsignal.o ./timeval-utils.o ./unlink-if-ordinary.o ./xasprintf.o ./xatexit.o ./xexit.o ./xmalloc.o ./xmemdup.o ./xstrdup.o ./xstrerror.o ./xstrndup.o ./xvasprintf.o  ./setproctitle.o
ranlib ./libiberty.a
if [ x"" != x ]; then \
  cd pic; \
  ar rc ./libiberty.a \
    ./regex.o ./cplus-dem.o ./cp-demangle.o ./md5.o ./sha1.o ./alloca.o ./argv.o ./choose-temp.o ./concat.o ./cp-demint.o ./crc32.o ./d-demangle.o ./dwarfnames.o ./dyn-string.o ./fdmatch.o ./fibheap.o ./filename_cmp.o ./floatformat.o ./fnmatch.o ./fopen_unlocked.o ./getopt.o ./getopt1.o ./getpwd.o ./getruntime.o ./hashtab.o ./hex.o ./lbasename.o ./lrealpath.o ./make-relative-prefix.o ./make-temp-file.o ./objalloc.o ./obstack.o ./partition.o ./pexecute.o ./physmem.o ./pex-common.o ./pex-one.o ./pex-unix.o ./vprintf-support.o ./rust-demangle.o ./safe-ctype.o ./simple-object.o ./simple-object-coff.o ./simple-object-elf.o ./simple-object-mach-o.o ./simple-object-xcoff.o ./sort.o ./spaces.o ./splay-tree.o ./stack-limit.o ./strerror.o ./strsignal.o ./timeval-utils.o ./unlink-if-ordinary.o ./xasprintf.o ./xatexit.o ./xexit.o ./xmalloc.o ./xmemdup.o ./xstrdup.o ./xstrerror.o ./xstrndup.o ./xvasprintf.o  ./setproctitle.o; \
  ranlib ./libiberty.a; \
  cd ..; \
else true; fi; \
if [ x"" != x ]; then \
  cd noasan; \
  ar rc ./libiberty.a \
    ./regex.o ./cplus-dem.o ./cp-demangle.o ./md5.o ./sha1.o ./alloca.o ./argv.o ./choose-temp.o ./concat.o ./cp-demint.o ./crc32.o ./d-demangle.o ./dwarfnames.o ./dyn-string.o ./fdmatch.o ./fibheap.o ./filename_cmp.o ./floatformat.o ./fnmatch.o ./fopen_unlocked.o ./getopt.o ./getopt1.o ./getpwd.o ./getruntime.o ./hashtab.o ./hex.o ./lbasename.o ./lrealpath.o ./make-relative-prefix.o ./make-temp-file.o ./objalloc.o ./obstack.o ./partition.o ./pexecute.o ./physmem.o ./pex-common.o ./pex-one.o ./pex-unix.o ./vprintf-support.o ./rust-demangle.o ./safe-ctype.o ./simple-object.o ./simple-object-coff.o ./simple-object-elf.o ./simple-object-mach-o.o ./simple-object-xcoff.o ./sort.o ./spaces.o ./splay-tree.o ./stack-limit.o ./strerror.o ./strsignal.o ./timeval-utils.o ./unlink-if-ordinary.o ./xasprintf.o ./xatexit.o ./xexit.o ./xmalloc.o ./xmemdup.o ./xstrdup.o ./xstrerror.o ./xstrndup.o ./xvasprintf.o  ./setproctitle.o; \
  ranlib ./libiberty.a; \
  cd ..; \
else true; fi
make[6]: Leaving directory '/home/gdb_buildbot/ubuntu16-aarch64/ubuntu-aarch64-native-extended-gdbserver-m64/build/gdb/gdbserver/build-libiberty-gdbserver'
make[5]: Leaving directory '/home/gdb_buildbot/ubuntu16-aarch64/ubuntu-aarch64-native-extended-gdbserver-m64/build/gdb/gdbserver'
  CXX    aarch64-linux-hw-point.o
  CXX    aarch64-linux.o
  CXX    aarch64-sve-linux-ptrace.o
  CXX    aarch64.o
  CXX    arch/aarch64-insn.o
  CXX    arch/aarch64.o
  CXX    arch/arm.o
  CXX    arm-with-neon.o
  CXX    ax.o
  CXX    common/agent.o
  CXX    common/btrace-common.o
  CXX    common/buffer.o
  CXX    common/cleanups.o
  CXX    common/common-debug.o
  CXX    common/common-exceptions.o
  CXX    common/common-regcache.o
../../../binutils-gdb/gdb/gdbserver/../common/agent.c: In function int gdb_connect_sync_socket(int):
../../../binutils-gdb/gdb/gdbserver/../common/agent.c:164:16: error: close was not declared in this scope
       close (fd);
                ^
../../../binutils-gdb/gdb/gdbserver/../common/agent.c:174:16: error: close was not declared in this scope
       close (fd);
                ^
../../../binutils-gdb/gdb/gdbserver/../common/agent.c: In function int agent_run_command(int, const char*, int):
../../../binutils-gdb/gdb/gdbserver/../common/agent.c:220:27: error: write was not declared in this scope
    ret = write (fd, buf, 1);
                           ^
../../../binutils-gdb/gdb/gdbserver/../common/agent.c:227:26: error: read was not declared in this scope
    ret = read (fd, buf, 1);
                          ^
../../../binutils-gdb/gdb/gdbserver/../common/agent.c:230:16: error: close was not declared in this scope
       close (fd);
                ^
  CXX    common/common-utils.o
  CXX    common/environ.o
Makefile:601: recipe for target 'common/agent.o' failed
make[4]: *** [common/agent.o] Error 1
make[4]: *** Waiting for unfinished jobs....
make[4]: Leaving directory '/home/gdb_buildbot/ubuntu16-aarch64/ubuntu-aarch64-native-extended-gdbserver-m64/build/gdb/gdbserver'
Makefile:2020: recipe for target 'subdir_do' failed
make[3]: *** [subdir_do] Error 1
make[3]: Leaving directory '/home/gdb_buildbot/ubuntu16-aarch64/ubuntu-aarch64-native-extended-gdbserver-m64/build/gdb'
Makefile:1627: recipe for target 'all' failed
make[2]: *** [all] Error 2
make[2]: Leaving directory '/home/gdb_buildbot/ubuntu16-aarch64/ubuntu-aarch64-native-extended-gdbserver-m64/build/gdb'
Makefile:8792: recipe for target 'all-gdb' failed
make[1]: *** [all-gdb] Error 2
make[1]: Leaving directory '/home/gdb_buildbot/ubuntu16-aarch64/ubuntu-aarch64-native-extended-gdbserver-m64/build'
Makefile:849: recipe for target 'all' failed
make: *** [all] Error 2
============================



Reply | Threaded
Open this post in threaded view
|

Failures on RHEL-s390x-m64, branch master

sergiodj+buildbot-2
In reply to this post by sergiodj+buildbot-2
Buildslave:
        rhel-7_1-s390x-1

Full Build URL:
        <http://gdb-build.sergiodj.net/builders/RHEL-s390x-m64/builds/8879>

Commit(s) tested:
        fde51dd189a1f8a63896bcb845ef36ea5e1917d5

Author(s) (in the same order as the commits):
        H.J. Lu <[hidden email]>

Subject:
        x86: Don't remove empty GNU_PROPERTY_X86_UINT32_OR_AND properties

Testsuite log (gdb.sum and gdb.log) URL(s):
        <http://gdb-build.sergiodj.net/results/RHEL-s390x-m64/fd/fde51dd189a1f8a63896bcb845ef36ea5e1917d5/>

*** Diff to previous build ***
============================
new FAIL: gdb.threads/interrupt-while-step-over.exp: displaced-stepping=off: iter=15: wait for stops
============================


*** Complete list of XFAILs for this builder ***

To obtain the list of XFAIL tests for this builder, go to:

        <https://git.sergiodj.net/gdb-xfails.git/tree/xfails/RHEL-s390x-m64/xfails/master/xfail?id=e8b4bade>

You can also see a pretty-printed version of the list, with more information
about each XFAIL, by going to:

        <https://git.sergiodj.net/gdb-xfails.git/tree/xfails/RHEL-s390x-m64/xfails/master/xfail.table?id=e8b4bade>



Reply | Threaded
Open this post in threaded view
|

Failures on Fedora-i686, branch master

sergiodj+buildbot-2
In reply to this post by sergiodj+buildbot-2
Buildslave:
        fedora-x86-64-2

Full Build URL:
        <http://gdb-build.sergiodj.net/builders/Fedora-i686/builds/11591>

Commit(s) tested:
        fde51dd189a1f8a63896bcb845ef36ea5e1917d5

Author(s) (in the same order as the commits):
        H.J. Lu <[hidden email]>

Subject:
        x86: Don't remove empty GNU_PROPERTY_X86_UINT32_OR_AND properties

Testsuite log (gdb.sum and gdb.log) URL(s):
        <http://gdb-build.sergiodj.net/results/Fedora-i686/fd/fde51dd189a1f8a63896bcb845ef36ea5e1917d5/>

*** Diff to previous build ***
============================
PASS -> FAIL: gdb.python/py-mi-var-info-path-expression.exp: -var-list-children c1
PASS -> FAIL: gdb.python/py-mi-var-info-path-expression.exp: -var-list-children c1.car
PASS -> FAIL: gdb.python/py-mi-var-info-path-expression.exp: -var-list-children c1.car.atom
PASS -> FAIL: gdb.python/py-mi-var-info-path-expression.exp: -var-list-children c1.cdr
PASS -> UNRESOLVED: gdb.python/py-mi-var-info-path-expression.exp: load python file
============================


*** Complete list of XFAILs for this builder ***

To obtain the list of XFAIL tests for this builder, go to:

        <https://git.sergiodj.net/gdb-xfails.git/tree/xfails/Fedora-i686/xfails/master/xfail?id=d9b5a952>

You can also see a pretty-printed version of the list, with more information
about each XFAIL, by going to:

        <https://git.sergiodj.net/gdb-xfails.git/tree/xfails/Fedora-i686/xfails/master/xfail.table?id=d9b5a952>



Reply | Threaded
Open this post in threaded view
|

Failures on Fedora-x86_64-cc-with-index, branch master

sergiodj+buildbot-2
In reply to this post by sergiodj+buildbot-2
Buildslave:
        fedora-x86-64-1

Full Build URL:
        <http://gdb-build.sergiodj.net/builders/Fedora-x86_64-cc-with-index/builds/11505>

Commit(s) tested:
        fde51dd189a1f8a63896bcb845ef36ea5e1917d5

Author(s) (in the same order as the commits):
        H.J. Lu <[hidden email]>

Subject:
        x86: Don't remove empty GNU_PROPERTY_X86_UINT32_OR_AND properties

Testsuite log (gdb.sum and gdb.log) URL(s):
        <http://gdb-build.sergiodj.net/results/Fedora-x86_64-cc-with-index/fd/fde51dd189a1f8a63896bcb845ef36ea5e1917d5/>

*** Diff to previous build ***
============================
PASS -> KFAIL: gdb.threads/non-ldr-exit.exp: program exits normally
PASS -> KFAIL: gdb.threads/process-dies-while-handling-bp.exp: non_stop=off: cond_bp_target=1: inferior 1 exited
============================


*** Complete list of XFAILs for this builder ***

To obtain the list of XFAIL tests for this builder, go to:

        <https://git.sergiodj.net/gdb-xfails.git/tree/xfails/Fedora-x86_64-cc-with-index/xfails/master/xfail?id=041e56cd>

You can also see a pretty-printed version of the list, with more information
about each XFAIL, by going to:

        <https://git.sergiodj.net/gdb-xfails.git/tree/xfails/Fedora-x86_64-cc-with-index/xfails/master/xfail.table?id=041e56cd>



Reply | Threaded
Open this post in threaded view
|

Failures on Ubuntu-Aarch64-native-gdbserver-m64, branch master

sergiodj+buildbot-2
In reply to this post by sergiodj+buildbot-2
Buildslave:
        ubuntu16-aarch64

Full Build URL:
        <http://gdb-build.sergiodj.net/builders/Ubuntu-Aarch64-native-gdbserver-m64/builds/4604>

Commit(s) tested:
        fde51dd189a1f8a63896bcb845ef36ea5e1917d5

Author(s) (in the same order as the commits):
        H.J. Lu <[hidden email]>

Subject:
        x86: Don't remove empty GNU_PROPERTY_X86_UINT32_OR_AND properties

Testsuite log (gdb.sum and gdb.log) URL(s):
        <http://gdb-build.sergiodj.net/results/Ubuntu-Aarch64-native-gdbserver-m64/fd/fde51dd189a1f8a63896bcb845ef36ea5e1917d5/>




Reply | Threaded
Open this post in threaded view
|

Failures on Fedora-x86_64-m64, branch master

sergiodj+buildbot-2
In reply to this post by sergiodj+buildbot-2
Buildslave:
        fedora-x86-64-1

Full Build URL:
        <http://gdb-build.sergiodj.net/builders/Fedora-x86_64-m64/builds/11645>

Commit(s) tested:
        fde51dd189a1f8a63896bcb845ef36ea5e1917d5

Author(s) (in the same order as the commits):
        H.J. Lu <[hidden email]>

Subject:
        x86: Don't remove empty GNU_PROPERTY_X86_UINT32_OR_AND properties

Testsuite log (gdb.sum and gdb.log) URL(s):
        <http://gdb-build.sergiodj.net/results/Fedora-x86_64-m64/fd/fde51dd189a1f8a63896bcb845ef36ea5e1917d5/>

*** Diff to previous build ***
============================
PASS -> KFAIL: gdb.threads/process-dies-while-handling-bp.exp: non_stop=on: cond_bp_target=0: inferior 1 exited
============================


*** Complete list of XFAILs for this builder ***

To obtain the list of XFAIL tests for this builder, go to:

        <https://git.sergiodj.net/gdb-xfails.git/tree/xfails/Fedora-x86_64-m64/xfails/master/xfail?id=cdf6907c>

You can also see a pretty-printed version of the list, with more information
about each XFAIL, by going to:

        <https://git.sergiodj.net/gdb-xfails.git/tree/xfails/Fedora-x86_64-m64/xfails/master/xfail.table?id=cdf6907c>



Reply | Threaded
Open this post in threaded view
|

Failures on Fedora-x86_64-native-gdbserver-m64, branch master

sergiodj+buildbot-2
In reply to this post by sergiodj+buildbot-2
Buildslave:
        fedora-x86-64-2

Full Build URL:
        <http://gdb-build.sergiodj.net/builders/Fedora-x86_64-native-gdbserver-m64/builds/11506>

Commit(s) tested:
        fde51dd189a1f8a63896bcb845ef36ea5e1917d5

Author(s) (in the same order as the commits):
        H.J. Lu <[hidden email]>

Subject:
        x86: Don't remove empty GNU_PROPERTY_X86_UINT32_OR_AND properties

Testsuite log (gdb.sum and gdb.log) URL(s):
        <http://gdb-build.sergiodj.net/results/Fedora-x86_64-native-gdbserver-m64/fd/fde51dd189a1f8a63896bcb845ef36ea5e1917d5/>

*** Diff to previous build ***
============================
PASS -> KFAIL: gdb.threads/process-dies-while-handling-bp.exp: non_stop=on: cond_bp_target=1: inferior 1 exited
============================


*** Complete list of XFAILs for this builder ***

To obtain the list of XFAIL tests for this builder, go to:

        <https://git.sergiodj.net/gdb-xfails.git/tree/xfails/Fedora-x86_64-native-gdbserver-m64/xfails/master/xfail?id=5da39731>

You can also see a pretty-printed version of the list, with more information
about each XFAIL, by going to:

        <https://git.sergiodj.net/gdb-xfails.git/tree/xfails/Fedora-x86_64-native-gdbserver-m64/xfails/master/xfail.table?id=5da39731>



Reply | Threaded
Open this post in threaded view
|

Failures on Fedora-x86_64-native-extended-gdbserver-m32, branch master

sergiodj+buildbot-2
In reply to this post by sergiodj+buildbot-2
Buildslave:
        fedora-x86-64-4

Full Build URL:
        <http://gdb-build.sergiodj.net/builders/Fedora-x86_64-native-extended-gdbserver-m32/builds/11270>

Commit(s) tested:
        fde51dd189a1f8a63896bcb845ef36ea5e1917d5

Author(s) (in the same order as the commits):
        H.J. Lu <[hidden email]>

Subject:
        x86: Don't remove empty GNU_PROPERTY_X86_UINT32_OR_AND properties

Testsuite log (gdb.sum and gdb.log) URL(s):
        <http://gdb-build.sergiodj.net/results/Fedora-x86_64-native-extended-gdbserver-m32/fd/fde51dd189a1f8a63896bcb845ef36ea5e1917d5/>

*** Diff to previous build ***
============================
PASS -> FAIL: gdb.base/foll-exec-mode.exp: same,continue,no_infswitch: use correct executable
PASS -> FAIL: gdb.base/fork-print-inferior-events.exp: print_inferior_events=off: follow_fork_mode=child: detach_on_fork=off: run
PASS -> FAIL: gdb.base/fork-print-inferior-events.exp: print_inferior_events=off: follow_fork_mode=parent: detach_on_fork=off: run
PASS -> FAIL: gdb.base/fork-print-inferior-events.exp: print_inferior_events=on: follow_fork_mode=child: detach_on_fork=off: run
PASS -> FAIL: gdb.base/fork-print-inferior-events.exp: print_inferior_events=on: follow_fork_mode=parent: detach_on_fork=off: run
PASS -> FAIL: gdb.base/multi-forks.exp: info inferior 1
PASS -> FAIL: gdb.base/multi-forks.exp: info inferior 6
PASS -> FAIL: gdb.base/multi-forks.exp: run to exit 6
UNRESOLVED -> FAIL: gdb.mi/mi-exec-run.exp: inferior-tty=main: mi=main: force-fail=1: run failure detected
UNRESOLVED -> FAIL: gdb.mi/mi-exec-run.exp: inferior-tty=main: mi=separate: force-fail=1: run failure detected
UNRESOLVED -> FAIL: gdb.mi/mi-exec-run.exp: inferior-tty=separate: mi=main: force-fail=1: run failure detected
UNRESOLVED -> FAIL: gdb.mi/mi-exec-run.exp: inferior-tty=separate: mi=separate: force-fail=1: run failure detected
============================


*** Complete list of XFAILs for this builder ***

To obtain the list of XFAIL tests for this builder, go to:

        <https://git.sergiodj.net/gdb-xfails.git/tree/xfails/Fedora-x86_64-native-extended-gdbserver-m32/xfails/master/xfail?id=d39bf374>

You can also see a pretty-printed version of the list, with more information
about each XFAIL, by going to:

        <https://git.sergiodj.net/gdb-xfails.git/tree/xfails/Fedora-x86_64-native-extended-gdbserver-m32/xfails/master/xfail.table?id=d39bf374>



Reply | Threaded
Open this post in threaded view
|

Failures on Ubuntu-Aarch64-m64, branch master

sergiodj+buildbot-2
In reply to this post by sergiodj+buildbot-2
Buildslave:
        ubuntu16-aarch64

Full Build URL:
        <http://gdb-build.sergiodj.net/builders/Ubuntu-Aarch64-m64/builds/4672>

Commit(s) tested:
        fde51dd189a1f8a63896bcb845ef36ea5e1917d5

Author(s) (in the same order as the commits):
        H.J. Lu <[hidden email]>

Subject:
        x86: Don't remove empty GNU_PROPERTY_X86_UINT32_OR_AND properties

Testsuite log (gdb.sum and gdb.log) URL(s):
        <http://gdb-build.sergiodj.net/results/Ubuntu-Aarch64-m64/fd/fde51dd189a1f8a63896bcb845ef36ea5e1917d5/>

*** Diff to previous build ***
============================
PASS -> FAIL: gdb.base/step-over-syscall.exp: clone: displaced=off: single step over clone
PASS -> FAIL: gdb.server/abspath.exp: continue to main
PASS -> FAIL: gdb.server/ext-run.exp: continue to main
PASS -> FAIL: gdb.server/reconnect-ctrl-c.exp: second: continue for ctrl-c
PASS -> FAIL: gdb.server/reconnect-ctrl-c.exp: second: stop with control-c
============================


*** Complete list of XFAILs for this builder ***

To obtain the list of XFAIL tests for this builder, go to:

        <https://git.sergiodj.net/gdb-xfails.git/tree/xfails/Ubuntu-Aarch64-m64/xfails/master/xfail?id=60187cc3>

You can also see a pretty-printed version of the list, with more information
about each XFAIL, by going to:

        <https://git.sergiodj.net/gdb-xfails.git/tree/xfails/Ubuntu-Aarch64-m64/xfails/master/xfail.table?id=60187cc3>



Reply | Threaded
Open this post in threaded view
|

Failures on Debian-s390x-m64, branch master

sergiodj+buildbot-2
In reply to this post by sergiodj+buildbot-2
Buildslave:
        debian-jessie-s390x-1

Full Build URL:
        <http://gdb-build.sergiodj.net/builders/Debian-s390x-m64/builds/6998>

Commit(s) tested:
        fde51dd189a1f8a63896bcb845ef36ea5e1917d5

Author(s) (in the same order as the commits):
        H.J. Lu <[hidden email]>

Subject:
        x86: Don't remove empty GNU_PROPERTY_X86_UINT32_OR_AND properties

Testsuite log (gdb.sum and gdb.log) URL(s):
        <http://gdb-build.sergiodj.net/results/Debian-s390x-m64/fd/fde51dd189a1f8a63896bcb845ef36ea5e1917d5/>

*** Diff to previous build ***
============================
PASS -> KFAIL: gdb.threads/process-dies-while-handling-bp.exp: non_stop=off: cond_bp_target=0: inferior 1 exited
PASS -> KFAIL: gdb.threads/process-dies-while-handling-bp.exp: non_stop=off: cond_bp_target=1: inferior 1 exited
PASS -> KFAIL: gdb.threads/process-dies-while-handling-bp.exp: non_stop=on: cond_bp_target=0: inferior 1 exited
============================


*** Complete list of XFAILs for this builder ***

To obtain the list of XFAIL tests for this builder, go to:

        <https://git.sergiodj.net/gdb-xfails.git/tree/xfails/Debian-s390x-m64/xfails/master/xfail?id=e26baaf6>

You can also see a pretty-printed version of the list, with more information
about each XFAIL, by going to:

        <https://git.sergiodj.net/gdb-xfails.git/tree/xfails/Debian-s390x-m64/xfails/master/xfail.table?id=e26baaf6>



Reply | Threaded
Open this post in threaded view
|

Failures on Fedora-x86_64-native-gdbserver-m32, branch master

sergiodj+buildbot-2
In reply to this post by sergiodj+buildbot-2
Buildslave:
        fedora-x86-64-3

Full Build URL:
        <http://gdb-build.sergiodj.net/builders/Fedora-x86_64-native-gdbserver-m32/builds/11276>

Commit(s) tested:
        fde51dd189a1f8a63896bcb845ef36ea5e1917d5

Author(s) (in the same order as the commits):
        H.J. Lu <[hidden email]>

Subject:
        x86: Don't remove empty GNU_PROPERTY_X86_UINT32_OR_AND properties

Testsuite log (gdb.sum and gdb.log) URL(s):
        <http://gdb-build.sergiodj.net/results/Fedora-x86_64-native-gdbserver-m32/fd/fde51dd189a1f8a63896bcb845ef36ea5e1917d5/>

*** Diff to previous build ***
============================
PASS -> KFAIL: gdb.threads/process-dies-while-handling-bp.exp: non_stop=off: cond_bp_target=1: inferior 1 exited
PASS -> KFAIL: gdb.threads/process-dies-while-handling-bp.exp: non_stop=on: cond_bp_target=0: inferior 1 exited
============================


*** Complete list of XFAILs for this builder ***

To obtain the list of XFAIL tests for this builder, go to:

        <https://git.sergiodj.net/gdb-xfails.git/tree/xfails/Fedora-x86_64-native-gdbserver-m32/xfails/master/xfail?id=10f8ea55>

You can also see a pretty-printed version of the list, with more information
about each XFAIL, by going to:

        <https://git.sergiodj.net/gdb-xfails.git/tree/xfails/Fedora-x86_64-native-gdbserver-m32/xfails/master/xfail.table?id=10f8ea55>