[binutils-gdb] ubsan: alpha-vms: shift exponent 536874240 is too large

classic Classic list List threaded Threaded
9 messages Options
Reply | Threaded
Open this post in threaded view
|

[binutils-gdb] ubsan: alpha-vms: shift exponent 536874240 is too large

gdb-buildbot-2
*** TEST RESULTS FOR COMMIT f8b1e5f6fcdb27c7ea520643880a208578d42d0e ***

commit f8b1e5f6fcdb27c7ea520643880a208578d42d0e
Author:     Alan Modra <[hidden email]>
AuthorDate: Wed Jun 24 10:24:32 2020 +0930
Commit:     Alan Modra <[hidden email]>
CommitDate: Wed Jun 24 10:48:15 2020 +0930

    ubsan: alpha-vms: shift exponent 536874240 is too large
   
    C_OPR_ASH is supposed to be an arithmetic shift.  By the look of it,
    this operator implemented logical shifts since the original binutils
    support was added.  This patch corrects that and avoids some nonsense
    ubsan complaints.  I chose to implement infinite precision shifts
    rather than masking shift counts to the word size as the spec I had is
    silent on what is supposed to happen with overlarge shift counts.
   
            * vms-alpha.c (_bfd_vms_slurp_etir <ETIR__C_OPR_ASH>): Implement
            shifts without undefined behaviour.

diff --git a/bfd/ChangeLog b/bfd/ChangeLog
index 5d1075e743..9c202b27fc 100644
--- a/bfd/ChangeLog
+++ b/bfd/ChangeLog
@@ -1,3 +1,8 @@
+2020-06-24  Alan Modra  <[hidden email]>
+
+ * vms-alpha.c (_bfd_vms_slurp_etir <ETIR__C_OPR_ASH>): Implement
+ shifts without undefined behaviour.
+
 2020-06-23  H.J. Lu  <[hidden email]>
 
  * elf-bfd.h (elf_link_hash_table): Add dt_pltgot_required and
diff --git a/bfd/vms-alpha.c b/bfd/vms-alpha.c
index e31a9e4ca1..5bf32d6780 100644
--- a/bfd/vms-alpha.c
+++ b/bfd/vms-alpha.c
@@ -34,6 +34,7 @@
 */
 
 #include "sysdep.h"
+#include <limits.h>
 #include "bfd.h"
 #include "bfdlink.h"
 #include "libbfd.h"
@@ -71,6 +72,9 @@
 
 
 #define MIN(a,b) ((a) < (b) ? (a) : (b))
+#ifndef CHAR_BIT
+#define CHAR_BIT 8
+#endif
 
 /* The r_type field in a reloc is one of the following values.  */
 #define ALPHA_R_IGNORE 0
@@ -2520,10 +2524,27 @@ _bfd_vms_slurp_etir (bfd *abfd, struct bfd_link_info *info)
   _bfd_vms_etir_name (cmd));
       return FALSE;
     }
-  if ((int)op2 < 0) /* Shift right.  */
-    op1 >>= -(int)op2;
-  else /* Shift left.  */
-    op1 <<= (int)op2;
+  if ((bfd_signed_vma) op2 < 0)
+    {
+      /* Shift right.  */
+      bfd_vma sign;
+      op2 = -op2;
+      if (op2 >= CHAR_BIT * sizeof (op1))
+ op2 = CHAR_BIT * sizeof (op1) - 1;
+      /* op1 = (bfd_signed_vma) op1 >> op2; */
+      sign = op1 & ((bfd_vma) 1 << (CHAR_BIT * sizeof (op1) - 1));
+      op1 >>= op2;
+      sign >>= op2;
+      op1 = (op1 ^ sign) - sign;
+    }
+  else
+    {
+      /* Shift left.  */
+      if (op2 >= CHAR_BIT * sizeof (op1))
+ op1 = 0;
+      else
+ op1 <<= op2;
+    }
   if (!_bfd_vms_push (abfd, op1, RELC_NONE)) /* FIXME: sym.  */
     return FALSE;
   break;
Reply | Threaded
Open this post in threaded view
|

*** COMPILATION FAILED *** Failures on Fedora-i686, branch master *** BREAKAGE ***

gdb-buildbot-2
Buildername:
        Fedora-i686

Worker:
        fedora-x86-64-3

Full Build URL:
        https://gdb-buildbot.osci.io/#builders/18/builds/3558

Author:
        Alan Modra <[hidden email]>

Commit tested:
        f8b1e5f6fcdb27c7ea520643880a208578d42d0e

Subject of commit:
        ubsan: alpha-vms: shift exponent 536874240 is too large

*** FAILED to build GDB -- compile gdb ***
==============================================

+++ The full log is too big to be posted here.
+++ These are the last 100 lines of it.

  CXX    user-regs.o
  CXX    utils.o
  CXX    v850-tdep.o
  CXX    valarith.o
  CXX    valops.o
  CXX    valprint.o
  CXX    value.o
  CXX    varobj.o
  CXX    vax-nbsd-tdep.o
  CXX    vax-tdep.o
  GEN    stamp-version
  CXX    windows-tdep.o
  CXX    x86-linux-nat.o
  CXX    x86-nat.o
  CXX    x86-tdep.o
  CXX    xcoffread.o
  GEN    xml-builtin.c
  CXX    xml-support.o
  CXX    xml-syscall.o
  CXX    xml-tdesc.o
  CXX    xstormy16-tdep.o
  CXX    xtensa-config.o
  CXX    xtensa-linux-tdep.o
  CXX    xtensa-tdep.o
  CXX    gdb.o
  CXX    aarch32-tdep.o
  CXX    ada-exp.o
  CXX    ada-lang.o
  CXX    ada-tasks.o
  CXX    ada-typeprint.o
  CXX    ada-valprint.o
  CXX    ada-varobj.o
  CXX    addrmap.o
  CXX    agent.o
  CXX    alloc.o
  CXX    annotate.o
  CXX    arc-tdep.o
  CXX    arch-utils.o
  CXX    arch/aarch32.o
  CXX    arch/arc.o
  CXX    arch/arm-get-next-pcs.o
  CXX    arch/arm-linux.o
  CXX    arch/arm.o
  CXX    arch/i386.o
  CXX    arch/ppc-linux-common.o
  CXX    arch/riscv.o
  CXX    arm-bsd-tdep.o
  CXX    arm-fbsd-tdep.o
  CXX    arm-linux-tdep.o
  CXX    arm-nbsd-tdep.o
  CXX    arm-obsd-tdep.o
  CXX    arm-pikeos-tdep.o
  CXX    arm-symbian-tdep.o
  CXX    arm-tdep.o
  CXX    arm-wince-tdep.o
  CXX    async-event.o
  CXX    auto-load.o
  CXX    auxv.o
  CXX    avr-tdep.o
  CXX    ax-gdb.o
  CXX    ax-general.o
  CXX    bcache.o
  CXX    bfd-target.o
  CXX    bfin-linux-tdep.o
  CXX    bfin-tdep.o
  CXX    block.o
  CXX    blockframe.o
  CXX    break-catch-sig.o
  CXX    break-catch-syscall.o
  CXX    break-catch-throw.o
  CXX    breakpoint.o
  CXX    bsd-uthread.o
  CXX    btrace.o
  CXX    build-id.o
  CXX    buildsym-legacy.o
  CXX    buildsym.o
  CXX    c-exp.o
  CXX    cp-name-parser.o
  CXX    d-exp.o
  CXX    f-exp.o
  CXX    go-exp.o
  CXX    m2-exp.o
  CXX    p-exp.o
  CXX    rust-exp.o
  CXX    version.o
  CXX    xml-builtin.o
  GEN    init.c
  CXX    init.o
  CXXLD  gdb
/usr/bin/ld: ../opcodes/libopcodes.a(riscv-dis.o): in function `parse_riscv_dis_option':
/home/gdb-buildbot/fedora-x86-64-3/fedora-i686/build/opcodes/../../binutils-gdb/opcodes/riscv-dis.c:102: undefined reference to `riscv_get_priv_spec_class'
collect2: error: ld returned 1 exit status
make[2]: *** [Makefile:1861: gdb] Error 1
make[2]: Leaving directory '/home/gdb-buildbot/fedora-x86-64-3/fedora-i686/build/gdb'
make[1]: *** [Makefile:10066: all-gdb] Error 2
make[1]: Leaving directory '/home/gdb-buildbot/fedora-x86-64-3/fedora-i686/build'
make: *** [Makefile:854: all] Error 2
program finished with exit code 2
elapsedTime=472.358609
==============================================

Reply | Threaded
Open this post in threaded view
|

Failures on Fedora-x86_64-cc-with-index, branch master

gdb-buildbot-2
In reply to this post by gdb-buildbot-2
Buildername:
        Fedora-x86_64-cc-with-index

Worker:
        fedora-x86-64-3

Full Build URL:
        https://gdb-buildbot.osci.io/#builders/20/builds/3506

Author:
        Alan Modra <[hidden email]>

Commit tested:
        f8b1e5f6fcdb27c7ea520643880a208578d42d0e

Subject of commit:
        ubsan: alpha-vms: shift exponent 536874240 is too large

Testsuite logs (gdb.sum, gdb.log and others):
        https://gdb-buildbot.osci.io/results/Fedora-x86_64-cc-with-index/f8/f8b1e5f6fcdb27c7ea520643880a208578d42d0e/

*** Diff to previous build ***
==============================================
new KFAIL: gdb.base/step-over-syscall.exp: clone: displaced=on: single step over clone
PASS -> KFAIL: gdb.threads/omp-par-scope.exp: nested_parallel: inner_threads: 3rd stop: print i
PASS -> KFAIL: gdb.threads/omp-par-scope.exp: nested_parallel: inner_threads: 3rd stop: print j
PASS -> KFAIL: gdb.threads/omp-par-scope.exp: single_scope: first thread: print i3
==============================================

*** Complete list of XFAILs for this builder ***

To obtain the list of XFAIL tests for this builder, go to:

        <https://gdb-buildbot.osci.io/results/Fedora-x86_64-cc-with-index/f8/f8b1e5f6fcdb27c7ea520643880a208578d42d0e//xfail.gz>

You can also see a pretty-printed version of the list, with more information
about each XFAIL, by going to:

        <https://gdb-buildbot.osci.io/results/Fedora-x86_64-cc-with-index/f8/f8b1e5f6fcdb27c7ea520643880a208578d42d0e//xfail.table.gz>

Reply | Threaded
Open this post in threaded view
|

Failures on Fedora-x86_64-m32, branch master

gdb-buildbot-2
In reply to this post by gdb-buildbot-2
Buildername:
        Fedora-x86_64-m32

Worker:
        fedora-x86-64-4

Full Build URL:
        https://gdb-buildbot.osci.io/#builders/17/builds/3552

Author:
        Alan Modra <[hidden email]>

Commit tested:
        f8b1e5f6fcdb27c7ea520643880a208578d42d0e

Subject of commit:
        ubsan: alpha-vms: shift exponent 536874240 is too large

Testsuite logs (gdb.sum, gdb.log and others):
        https://gdb-buildbot.osci.io/results/Fedora-x86_64-m32/f8/f8b1e5f6fcdb27c7ea520643880a208578d42d0e/

*** Diff to previous build ***
==============================================
new FAIL: gdb.base/coredump-filter.exp: disassembling function main for non-Private-Anonymous: no binary: loading /home/gdb-buildbot-2/fedora-x86-64-4/fedora-x86-64-m32/build/gdb/testsuite/outputs/gdb.base/coredump-filter/non-private-anon.gcore
new FAIL: gdb.base/coredump-filter.exp: loading and testing corefile for non-Shared-Anonymous: loading /home/gdb-buildbot-2/fedora-x86-64-4/fedora-x86-64-m32/build/gdb/testsuite/outputs/gdb.base/coredump-filter/non-shared-anon.gcore
PASS -> KFAIL: gdb.threads/process-dies-while-handling-bp.exp: non_stop=off: cond_bp_target=1: inferior 1 exited
==============================================

*** Complete list of XFAILs for this builder ***

To obtain the list of XFAIL tests for this builder, go to:

        <https://gdb-buildbot.osci.io/results/Fedora-x86_64-m32/f8/f8b1e5f6fcdb27c7ea520643880a208578d42d0e//xfail.gz>

You can also see a pretty-printed version of the list, with more information
about each XFAIL, by going to:

        <https://gdb-buildbot.osci.io/results/Fedora-x86_64-m32/f8/f8b1e5f6fcdb27c7ea520643880a208578d42d0e//xfail.table.gz>

Reply | Threaded
Open this post in threaded view
|

Failures on Fedora-x86_64-m64, branch master

gdb-buildbot-2
In reply to this post by gdb-buildbot-2
Buildername:
        Fedora-x86_64-m64

Worker:
        fedora-x86-64-3

Full Build URL:
        https://gdb-buildbot.osci.io/#builders/3/builds/3615

Author:
        Alan Modra <[hidden email]>

Commit tested:
        f8b1e5f6fcdb27c7ea520643880a208578d42d0e

Subject of commit:
        ubsan: alpha-vms: shift exponent 536874240 is too large

Testsuite logs (gdb.sum, gdb.log and others):
        https://gdb-buildbot.osci.io/results/Fedora-x86_64-m64/f8/f8b1e5f6fcdb27c7ea520643880a208578d42d0e/

*** Diff to previous build ***
==============================================
PASS -> KFAIL: gdb.threads/non-ldr-exit.exp: program exits normally
PASS -> KFAIL: gdb.threads/omp-par-scope.exp: multi_scope: first thread: print i02
PASS -> KFAIL: gdb.threads/omp-par-scope.exp: multi_scope: first thread: print i12
PASS -> KFAIL: gdb.threads/omp-par-scope.exp: multi_scope: first thread: print i22
PASS -> KFAIL: gdb.threads/omp-par-scope.exp: nested_func: 1st call: 2nd thread: print k
PASS -> KFAIL: gdb.threads/omp-par-scope.exp: nested_func: 1st call: 2nd thread: print r
PASS -> KFAIL: gdb.threads/omp-par-scope.exp: nested_func: 1st call: 2nd thread: print z
PASS -> KFAIL: gdb.threads/omp-par-scope.exp: nested_parallel: inner_threads: 1st stop: print i
PASS -> KFAIL: gdb.threads/omp-par-scope.exp: nested_parallel: inner_threads: 1st stop: print j
PASS -> KFAIL: gdb.threads/omp-par-scope.exp: single_scope: first thread: print i3
PASS -> KFAIL: gdb.threads/process-dies-while-handling-bp.exp: non_stop=off: cond_bp_target=0: inferior 1 exited
==============================================

*** Complete list of XFAILs for this builder ***

To obtain the list of XFAIL tests for this builder, go to:

        <https://gdb-buildbot.osci.io/results/Fedora-x86_64-m64/f8/f8b1e5f6fcdb27c7ea520643880a208578d42d0e//xfail.gz>

You can also see a pretty-printed version of the list, with more information
about each XFAIL, by going to:

        <https://gdb-buildbot.osci.io/results/Fedora-x86_64-m64/f8/f8b1e5f6fcdb27c7ea520643880a208578d42d0e//xfail.table.gz>

Reply | Threaded
Open this post in threaded view
|

Failures on Fedora-x86_64-native-extended-gdbserver-m32, branch master

gdb-buildbot-2
In reply to this post by gdb-buildbot-2
Buildername:
        Fedora-x86_64-native-extended-gdbserver-m32

Worker:
        fedora-x86-64-4

Full Build URL:
        https://gdb-buildbot.osci.io/#builders/4/builds/3448

Author:
        Alan Modra <[hidden email]>

Commit tested:
        f8b1e5f6fcdb27c7ea520643880a208578d42d0e

Subject of commit:
        ubsan: alpha-vms: shift exponent 536874240 is too large

Testsuite logs (gdb.sum, gdb.log and others):
        https://gdb-buildbot.osci.io/results/Fedora-x86_64-native-extended-gdbserver-m32/f8/f8b1e5f6fcdb27c7ea520643880a208578d42d0e/

*** Diff to previous build ***
==============================================
PASS -> FAIL: gdb.threads/attach-many-short-lived-threads.exp: iter 10: break at break_fn: 1
PASS -> FAIL: gdb.threads/attach-many-short-lived-threads.exp: iter 10: break at break_fn: 2
PASS -> FAIL: gdb.threads/attach-many-short-lived-threads.exp: iter 10: break at break_fn: 3
PASS -> FAIL: gdb.threads/attach-many-short-lived-threads.exp: iter 1: break at break_fn: 1
PASS -> FAIL: gdb.threads/attach-many-short-lived-threads.exp: iter 1: break at break_fn: 2
PASS -> FAIL: gdb.threads/attach-many-short-lived-threads.exp: iter 1: break at break_fn: 3
PASS -> FAIL: gdb.threads/attach-many-short-lived-threads.exp: iter 1: detach
PASS -> FAIL: gdb.threads/attach-many-short-lived-threads.exp: iter 1: reset timer in the inferior
PASS -> FAIL: gdb.threads/attach-many-short-lived-threads.exp: iter 2: break at break_fn: 1
PASS -> FAIL: gdb.threads/attach-many-short-lived-threads.exp: iter 2: break at break_fn: 2
PASS -> FAIL: gdb.threads/attach-many-short-lived-threads.exp: iter 2: break at break_fn: 3
PASS -> FAIL: gdb.threads/attach-many-short-lived-threads.exp: iter 2: detach
PASS -> FAIL: gdb.threads/attach-many-short-lived-threads.exp: iter 2: reset timer in the inferior
PASS -> FAIL: gdb.threads/attach-many-short-lived-threads.exp: iter 3: break at break_fn: 1
PASS -> FAIL: gdb.threads/attach-many-short-lived-threads.exp: iter 3: break at break_fn: 2
PASS -> FAIL: gdb.threads/attach-many-short-lived-threads.exp: iter 3: break at break_fn: 3
PASS -> FAIL: gdb.threads/attach-many-short-lived-threads.exp: iter 3: detach
PASS -> FAIL: gdb.threads/attach-many-short-lived-threads.exp: iter 3: reset timer in the inferior
PASS -> FAIL: gdb.threads/attach-many-short-lived-threads.exp: iter 4: break at break_fn: 1
PASS -> FAIL: gdb.threads/attach-many-short-lived-threads.exp: iter 4: break at break_fn: 2
PASS -> FAIL: gdb.threads/attach-many-short-lived-threads.exp: iter 4: break at break_fn: 3
PASS -> FAIL: gdb.threads/attach-many-short-lived-threads.exp: iter 4: detach
PASS -> FAIL: gdb.threads/attach-many-short-lived-threads.exp: iter 4: reset timer in the inferior
PASS -> FAIL: gdb.threads/attach-many-short-lived-threads.exp: iter 5: break at break_fn: 1
PASS -> FAIL: gdb.threads/attach-many-short-lived-threads.exp: iter 5: break at break_fn: 2
PASS -> FAIL: gdb.threads/attach-many-short-lived-threads.exp: iter 5: break at break_fn: 3
PASS -> FAIL: gdb.threads/attach-many-short-lived-threads.exp: iter 5: detach
PASS -> FAIL: gdb.threads/attach-many-short-lived-threads.exp: iter 5: reset timer in the inferior
PASS -> FAIL: gdb.threads/attach-many-short-lived-threads.exp: iter 6: break at break_fn: 1
PASS -> FAIL: gdb.threads/attach-many-short-lived-threads.exp: iter 6: break at break_fn: 2
PASS -> FAIL: gdb.threads/attach-many-short-lived-threads.exp: iter 6: break at break_fn: 3
PASS -> FAIL: gdb.threads/attach-many-short-lived-threads.exp: iter 6: detach
PASS -> FAIL: gdb.threads/attach-many-short-lived-threads.exp: iter 6: reset timer in the inferior
PASS -> FAIL: gdb.threads/attach-many-short-lived-threads.exp: iter 7: break at break_fn: 1
PASS -> FAIL: gdb.threads/attach-many-short-lived-threads.exp: iter 7: break at break_fn: 2
PASS -> FAIL: gdb.threads/attach-many-short-lived-threads.exp: iter 7: break at break_fn: 3
PASS -> FAIL: gdb.threads/attach-many-short-lived-threads.exp: iter 7: detach
PASS -> FAIL: gdb.threads/attach-many-short-lived-threads.exp: iter 7: reset timer in the inferior
PASS -> FAIL: gdb.threads/attach-many-short-lived-threads.exp: iter 8: break at break_fn: 1
PASS -> FAIL: gdb.threads/attach-many-short-lived-threads.exp: iter 8: break at break_fn: 2
PASS -> FAIL: gdb.threads/attach-many-short-lived-threads.exp: iter 8: break at break_fn: 3
PASS -> FAIL: gdb.threads/attach-many-short-lived-threads.exp: iter 8: detach
PASS -> FAIL: gdb.threads/attach-many-short-lived-threads.exp: iter 8: reset timer in the inferior
PASS -> FAIL: gdb.threads/attach-many-short-lived-threads.exp: iter 9: break at break_fn: 1
PASS -> FAIL: gdb.threads/attach-many-short-lived-threads.exp: iter 9: break at break_fn: 2
PASS -> FAIL: gdb.threads/attach-many-short-lived-threads.exp: iter 9: break at break_fn: 3
PASS -> FAIL: gdb.threads/attach-many-short-lived-threads.exp: iter 9: detach
PASS -> FAIL: gdb.threads/attach-many-short-lived-threads.exp: iter 9: reset timer in the inferior
FAIL -> UNRESOLVED: gdb.threads/fork-plus-threads.exp: detach-on-fork=off: inferior 1 exited
PASS -> FAIL: gdb.threads/interrupted-hand-call.exp: continue until exit
PASS -> FAIL: gdb.threads/thread-unwindonsignal.exp: continue until exit
==============================================

*** Complete list of XFAILs for this builder ***

To obtain the list of XFAIL tests for this builder, go to:

        <https://gdb-buildbot.osci.io/results/Fedora-x86_64-native-extended-gdbserver-m32/f8/f8b1e5f6fcdb27c7ea520643880a208578d42d0e//xfail.gz>

You can also see a pretty-printed version of the list, with more information
about each XFAIL, by going to:

        <https://gdb-buildbot.osci.io/results/Fedora-x86_64-native-extended-gdbserver-m32/f8/f8b1e5f6fcdb27c7ea520643880a208578d42d0e//xfail.table.gz>

Reply | Threaded
Open this post in threaded view
|

Failures on Fedora-x86_64-native-extended-gdbserver-m64, branch master

gdb-buildbot-2
In reply to this post by gdb-buildbot-2
Buildername:
        Fedora-x86_64-native-extended-gdbserver-m64

Worker:
        fedora-x86-64-3

Full Build URL:
        https://gdb-buildbot.osci.io/#builders/2/builds/3449

Author:
        Alan Modra <[hidden email]>

Commit tested:
        f8b1e5f6fcdb27c7ea520643880a208578d42d0e

Subject of commit:
        ubsan: alpha-vms: shift exponent 536874240 is too large

Testsuite logs (gdb.sum, gdb.log and others):
        https://gdb-buildbot.osci.io/results/Fedora-x86_64-native-extended-gdbserver-m64/f8/f8b1e5f6fcdb27c7ea520643880a208578d42d0e/

*** Diff to previous build ***
==============================================
PASS -> FAIL: gdb.base/options.exp: test-frame-apply: cmd complete "tfaas -"
PASS -> FAIL: gdb.base/options.exp: test-frame-apply: tab complete "tfaas -"
PASS -> FAIL: gdb.multi/multi-re-run.exp: re_run_inf=1: iter=1: continue until exit
PASS -> FAIL: gdb.multi/multi-re-run.exp: re_run_inf=1: iter=1: print re_run_var_1
new UNRESOLVED: gdb.multi/multi-re-run.exp: re_run_inf=1: iter=2: delete all breakpoints in delete_breakpoints
PASS -> UNRESOLVED: gdb.multi/multi-re-run.exp: re_run_inf=1: iter=2: setting breakpoint at all_started
new FAIL: gdb.multi/multi-re-run.exp: re_run_inf=2: iter=2: continue until exit
new FAIL: gdb.multi/multi-re-run.exp: re_run_inf=2: iter=2: print re_run_var_2
PASS -> UNRESOLVED: gdb.threads/attach-into-signal.exp: threaded: attach
new FAIL: gdb.threads/attach-into-signal.exp: threaded: thread apply 2 print $_siginfo.si_signo
PASS -> FAIL: gdb.threads/attach-many-short-lived-threads.exp: iter 10: break at break_fn: 1
PASS -> FAIL: gdb.threads/attach-many-short-lived-threads.exp: iter 10: break at break_fn: 2
PASS -> FAIL: gdb.threads/attach-many-short-lived-threads.exp: iter 10: break at break_fn: 3
PASS -> FAIL: gdb.threads/attach-many-short-lived-threads.exp: iter 3: break at break_fn: 1
PASS -> FAIL: gdb.threads/attach-many-short-lived-threads.exp: iter 3: break at break_fn: 2
PASS -> FAIL: gdb.threads/attach-many-short-lived-threads.exp: iter 3: break at break_fn: 3
PASS -> FAIL: gdb.threads/attach-many-short-lived-threads.exp: iter 3: detach
PASS -> FAIL: gdb.threads/attach-many-short-lived-threads.exp: iter 3: reset timer in the inferior
PASS -> FAIL: gdb.threads/attach-many-short-lived-threads.exp: iter 4: break at break_fn: 1
PASS -> FAIL: gdb.threads/attach-many-short-lived-threads.exp: iter 4: break at break_fn: 2
PASS -> FAIL: gdb.threads/attach-many-short-lived-threads.exp: iter 4: break at break_fn: 3
PASS -> FAIL: gdb.threads/attach-many-short-lived-threads.exp: iter 4: detach
PASS -> FAIL: gdb.threads/attach-many-short-lived-threads.exp: iter 4: reset timer in the inferior
PASS -> FAIL: gdb.threads/attach-many-short-lived-threads.exp: iter 5: break at break_fn: 1
PASS -> FAIL: gdb.threads/attach-many-short-lived-threads.exp: iter 5: break at break_fn: 2
PASS -> FAIL: gdb.threads/attach-many-short-lived-threads.exp: iter 5: break at break_fn: 3
PASS -> FAIL: gdb.threads/attach-many-short-lived-threads.exp: iter 5: detach
PASS -> FAIL: gdb.threads/attach-many-short-lived-threads.exp: iter 5: reset timer in the inferior
PASS -> FAIL: gdb.threads/attach-many-short-lived-threads.exp: iter 6: break at break_fn: 1
PASS -> FAIL: gdb.threads/attach-many-short-lived-threads.exp: iter 6: break at break_fn: 2
PASS -> FAIL: gdb.threads/attach-many-short-lived-threads.exp: iter 6: break at break_fn: 3
PASS -> FAIL: gdb.threads/attach-many-short-lived-threads.exp: iter 6: detach
PASS -> FAIL: gdb.threads/attach-many-short-lived-threads.exp: iter 6: reset timer in the inferior
PASS -> FAIL: gdb.threads/attach-many-short-lived-threads.exp: iter 7: break at break_fn: 1
PASS -> FAIL: gdb.threads/attach-many-short-lived-threads.exp: iter 7: break at break_fn: 2
PASS -> FAIL: gdb.threads/attach-many-short-lived-threads.exp: iter 7: break at break_fn: 3
PASS -> FAIL: gdb.threads/attach-many-short-lived-threads.exp: iter 7: detach
PASS -> FAIL: gdb.threads/attach-many-short-lived-threads.exp: iter 7: reset timer in the inferior
PASS -> FAIL: gdb.threads/attach-many-short-lived-threads.exp: iter 8: break at break_fn: 1
PASS -> FAIL: gdb.threads/attach-many-short-lived-threads.exp: iter 8: break at break_fn: 2
PASS -> FAIL: gdb.threads/attach-many-short-lived-threads.exp: iter 8: break at break_fn: 3
PASS -> FAIL: gdb.threads/attach-many-short-lived-threads.exp: iter 8: detach
PASS -> FAIL: gdb.threads/attach-many-short-lived-threads.exp: iter 8: reset timer in the inferior
PASS -> FAIL: gdb.threads/attach-many-short-lived-threads.exp: iter 9: break at break_fn: 1
PASS -> FAIL: gdb.threads/attach-many-short-lived-threads.exp: iter 9: break at break_fn: 2
PASS -> FAIL: gdb.threads/attach-many-short-lived-threads.exp: iter 9: break at break_fn: 3
PASS -> FAIL: gdb.threads/attach-many-short-lived-threads.exp: iter 9: detach
PASS -> FAIL: gdb.threads/attach-many-short-lived-threads.exp: iter 9: reset timer in the inferior
FAIL -> UNRESOLVED: gdb.threads/fork-plus-threads.exp: detach-on-fork=off: inferior 1 exited
PASS -> KFAIL: gdb.threads/omp-par-scope.exp: nested_parallel: inner_threads: 1st stop: print i
PASS -> KFAIL: gdb.threads/omp-par-scope.exp: nested_parallel: inner_threads: 1st stop: print j
==============================================

*** Complete list of XFAILs for this builder ***

To obtain the list of XFAIL tests for this builder, go to:

        <https://gdb-buildbot.osci.io/results/Fedora-x86_64-native-extended-gdbserver-m64/f8/f8b1e5f6fcdb27c7ea520643880a208578d42d0e//xfail.gz>

You can also see a pretty-printed version of the list, with more information
about each XFAIL, by going to:

        <https://gdb-buildbot.osci.io/results/Fedora-x86_64-native-extended-gdbserver-m64/f8/f8b1e5f6fcdb27c7ea520643880a208578d42d0e//xfail.table.gz>

Reply | Threaded
Open this post in threaded view
|

Failures on Fedora-x86_64-native-gdbserver-m32, branch master

gdb-buildbot-2
In reply to this post by gdb-buildbot-2
Buildername:
        Fedora-x86_64-native-gdbserver-m32

Worker:
        fedora-x86-64-4

Full Build URL:
        https://gdb-buildbot.osci.io/#builders/24/builds/3461

Author:
        Alan Modra <[hidden email]>

Commit tested:
        f8b1e5f6fcdb27c7ea520643880a208578d42d0e

Subject of commit:
        ubsan: alpha-vms: shift exponent 536874240 is too large

Testsuite logs (gdb.sum, gdb.log and others):
        https://gdb-buildbot.osci.io/results/Fedora-x86_64-native-gdbserver-m32/f8/f8b1e5f6fcdb27c7ea520643880a208578d42d0e/

*** Diff to previous build ***
==============================================
PASS -> UNRESOLVED: gdb.base/coredump-filter.exp: disassembling function main for non-Private-Anonymous: no binary: load core
new FAIL: gdb.base/coredump-filter.exp: disassembling function main for non-Private-Anonymous: no binary: loading /home/gdb-buildbot-2/fedora-x86-64-4/fedora-x86-64-native-gdbserver-m32/build/gdb/testsuite/outputs/gdb.base/coredump-filter/non-private-anon.gcore
PASS -> UNRESOLVED: gdb.base/coredump-filter.exp: loading and testing corefile for non-Shared-Anonymous: load core
new FAIL: gdb.base/coredump-filter.exp: loading and testing corefile for non-Shared-Anonymous: loading /home/gdb-buildbot-2/fedora-x86-64-4/fedora-x86-64-native-gdbserver-m32/build/gdb/testsuite/outputs/gdb.base/coredump-filter/non-shared-anon.gcore
new FAIL: gdb.base/coredump-filter.exp: loading and testing corefile for non-Shared-Anonymous: unsupported output from 'core' command
PASS -> FAIL: gdb.threads/interrupted-hand-call.exp: continue until exit
new KFAIL: gdb.threads/watchthreads2.exp: gdb can drop watchpoints in multithreaded app
==============================================

*** Complete list of XFAILs for this builder ***

To obtain the list of XFAIL tests for this builder, go to:

        <https://gdb-buildbot.osci.io/results/Fedora-x86_64-native-gdbserver-m32/f8/f8b1e5f6fcdb27c7ea520643880a208578d42d0e//xfail.gz>

You can also see a pretty-printed version of the list, with more information
about each XFAIL, by going to:

        <https://gdb-buildbot.osci.io/results/Fedora-x86_64-native-gdbserver-m32/f8/f8b1e5f6fcdb27c7ea520643880a208578d42d0e//xfail.table.gz>

Reply | Threaded
Open this post in threaded view
|

Failures on Fedora-x86_64-native-gdbserver-m64, branch master

gdb-buildbot-2
In reply to this post by gdb-buildbot-2
Buildername:
        Fedora-x86_64-native-gdbserver-m64

Worker:
        fedora-x86-64-3

Full Build URL:
        https://gdb-buildbot.osci.io/#builders/22/builds/3460

Author:
        Alan Modra <[hidden email]>

Commit tested:
        f8b1e5f6fcdb27c7ea520643880a208578d42d0e

Subject of commit:
        ubsan: alpha-vms: shift exponent 536874240 is too large

Testsuite logs (gdb.sum, gdb.log and others):
        https://gdb-buildbot.osci.io/results/Fedora-x86_64-native-gdbserver-m64/f8/f8b1e5f6fcdb27c7ea520643880a208578d42d0e/

*** Diff to previous build ***
==============================================
PASS -> FAIL: gdb.multi/multi-re-run.exp: re_run_inf=1: iter=1: continue until exit
PASS -> FAIL: gdb.multi/multi-re-run.exp: re_run_inf=1: iter=1: print re_run_var_1
new UNRESOLVED: gdb.multi/multi-re-run.exp: re_run_inf=1: iter=2: delete all breakpoints in delete_breakpoints
PASS -> UNRESOLVED: gdb.multi/multi-re-run.exp: re_run_inf=1: iter=2: setting breakpoint at all_started
new FAIL: gdb.multi/multi-re-run.exp: re_run_inf=2: iter=2: continue until exit
new FAIL: gdb.multi/multi-re-run.exp: re_run_inf=2: iter=2: print re_run_var_2
PASS -> KFAIL: gdb.threads/omp-par-scope.exp: nested_parallel: inner_threads: 1st stop: print i
PASS -> KFAIL: gdb.threads/omp-par-scope.exp: nested_parallel: inner_threads: 1st stop: print j
PASS -> KFAIL: gdb.threads/process-dies-while-handling-bp.exp: non_stop=on: cond_bp_target=1: inferior 1 exited
PASS -> FAIL: gdb.trace/mi-tsv-changed.exp: create delete modify: tvariable $tvar3 modified
==============================================

*** Complete list of XFAILs for this builder ***

To obtain the list of XFAIL tests for this builder, go to:

        <https://gdb-buildbot.osci.io/results/Fedora-x86_64-native-gdbserver-m64/f8/f8b1e5f6fcdb27c7ea520643880a208578d42d0e//xfail.gz>

You can also see a pretty-printed version of the list, with more information
about each XFAIL, by going to:

        <https://gdb-buildbot.osci.io/results/Fedora-x86_64-native-gdbserver-m64/f8/f8b1e5f6fcdb27c7ea520643880a208578d42d0e//xfail.table.gz>