[binutils-gdb] sim/cris: Fix references to cgen cpu directory

classic Classic list List threaded Threaded
16 messages Options
Reply | Threaded
Open this post in threaded view
|

[binutils-gdb] sim/cris: Fix references to cgen cpu directory

sergiodj+buildbot-2
*** TEST RESULTS FOR COMMIT 23ebf37881dda7fcf9dd86125705a30b6e2084ce ***

Author: Andrew Burgess <[hidden email]>
Branch: master
Commit: 23ebf37881dda7fcf9dd86125705a30b6e2084ce

sim/cris: Fix references to cgen cpu directory

Don't assume that cgen is located within the binutils-gdb tree.  We
already have CGEN_CPU_DIR and CPU_DIR defined, these are the cpu/
directory within cgen, and the cpu/ directory within binutils-cpu.

The cris target tries to find CPU_DIR relative to the cgen source
tree, which can be wrong when building with an out of tree cgen.

sim/cris/ChangeLog:

        * Makefile.in: Replace uses of CGEN_CPU_DIR with CPU_DIR, and
        remove the definition of CGEN_CPU_DIR.
Reply | Threaded
Open this post in threaded view
|

Failures on RHEL-s390x-m64, branch master

sergiodj+buildbot-2
Buildslave:
        rhel-7_1-s390x-1

Full Build URL:
        <http://gdb-build.sergiodj.net/builders/RHEL-s390x-m64/builds/8888>

Commit(s) tested:
        23ebf37881dda7fcf9dd86125705a30b6e2084ce

Author(s) (in the same order as the commits):
        Andrew Burgess <[hidden email]>

Subject:
        sim/cris: Fix references to cgen cpu directory

Testsuite log (gdb.sum and gdb.log) URL(s):
        <http://gdb-build.sergiodj.net/results/RHEL-s390x-m64/23/23ebf37881dda7fcf9dd86125705a30b6e2084ce/>

*** Diff to previous build ***
============================
PASS -> KFAIL: gdb.threads/process-dies-while-handling-bp.exp: non_stop=on: cond_bp_target=0: inferior 1 exited
============================


*** Complete list of XFAILs for this builder ***

To obtain the list of XFAIL tests for this builder, go to:

        <https://git.sergiodj.net/gdb-xfails.git/tree/xfails/RHEL-s390x-m64/xfails/master/xfail?id=e8b4bade>

You can also see a pretty-printed version of the list, with more information
about each XFAIL, by going to:

        <https://git.sergiodj.net/gdb-xfails.git/tree/xfails/RHEL-s390x-m64/xfails/master/xfail.table?id=e8b4bade>



Reply | Threaded
Open this post in threaded view
|

Failures on Debian-s390x-native-extended-gdbserver-m64, branch master

sergiodj+buildbot-2
In reply to this post by sergiodj+buildbot-2
Buildslave:
        debian-jessie-s390x-1

Full Build URL:
        <http://gdb-build.sergiodj.net/builders/Debian-s390x-native-extended-gdbserver-m64/builds/7194>

Commit(s) tested:
        23ebf37881dda7fcf9dd86125705a30b6e2084ce

Author(s) (in the same order as the commits):
        Andrew Burgess <[hidden email]>

Subject:
        sim/cris: Fix references to cgen cpu directory

Testsuite log (gdb.sum and gdb.log) URL(s):
        <http://gdb-build.sergiodj.net/results/Debian-s390x-native-extended-gdbserver-m64/23/23ebf37881dda7fcf9dd86125705a30b6e2084ce/>

*** Diff to previous build ***
============================
PASS -> KFAIL: gdb.threads/process-dies-while-handling-bp.exp: non_stop=on: cond_bp_target=1: inferior 1 exited
============================


*** Complete list of XFAILs for this builder ***

To obtain the list of XFAIL tests for this builder, go to:

        <https://git.sergiodj.net/gdb-xfails.git/tree/xfails/Debian-s390x-native-extended-gdbserver-m64/xfails/master/xfail?id=7e6e0858>

You can also see a pretty-printed version of the list, with more information
about each XFAIL, by going to:

        <https://git.sergiodj.net/gdb-xfails.git/tree/xfails/Debian-s390x-native-extended-gdbserver-m64/xfails/master/xfail.table?id=7e6e0858>



Reply | Threaded
Open this post in threaded view
|

Failures on Fedora-i686, branch master

sergiodj+buildbot-2
In reply to this post by sergiodj+buildbot-2
Buildslave:
        fedora-x86-64-2

Full Build URL:
        <http://gdb-build.sergiodj.net/builders/Fedora-i686/builds/11602>

Commit(s) tested:
        23ebf37881dda7fcf9dd86125705a30b6e2084ce

Author(s) (in the same order as the commits):
        Andrew Burgess <[hidden email]>

Subject:
        sim/cris: Fix references to cgen cpu directory

Testsuite log (gdb.sum and gdb.log) URL(s):
        <http://gdb-build.sergiodj.net/results/Fedora-i686/23/23ebf37881dda7fcf9dd86125705a30b6e2084ce/>

*** Diff to previous build ***
============================
PASS -> FAIL: gdb.mi/user-selected-context-sync.exp: mode=non-stop: test_setup: inferior 2: set breakpoint in main
PASS -> FAIL: gdb.python/py-mi-var-info-path-expression.exp: -var-list-children c1
PASS -> FAIL: gdb.python/py-mi-var-info-path-expression.exp: -var-list-children c1.car
PASS -> FAIL: gdb.python/py-mi-var-info-path-expression.exp: -var-list-children c1.car.atom
PASS -> FAIL: gdb.python/py-mi-var-info-path-expression.exp: -var-list-children c1.cdr
PASS -> UNRESOLVED: gdb.python/py-mi-var-info-path-expression.exp: load python file
PASS -> KFAIL: gdb.threads/process-dies-while-handling-bp.exp: non_stop=off: cond_bp_target=1: inferior 1 exited
============================


*** Complete list of XFAILs for this builder ***

To obtain the list of XFAIL tests for this builder, go to:

        <https://git.sergiodj.net/gdb-xfails.git/tree/xfails/Fedora-i686/xfails/master/xfail?id=a124d0ed>

You can also see a pretty-printed version of the list, with more information
about each XFAIL, by going to:

        <https://git.sergiodj.net/gdb-xfails.git/tree/xfails/Fedora-i686/xfails/master/xfail.table?id=a124d0ed>



Reply | Threaded
Open this post in threaded view
|

Failures on Debian-s390x-native-gdbserver-m64, branch master

sergiodj+buildbot-2
In reply to this post by sergiodj+buildbot-2
Buildslave:
        debian-jessie-s390x-1

Full Build URL:
        <http://gdb-build.sergiodj.net/builders/Debian-s390x-native-gdbserver-m64/builds/7051>

Commit(s) tested:
        23ebf37881dda7fcf9dd86125705a30b6e2084ce

Author(s) (in the same order as the commits):
        Andrew Burgess <[hidden email]>

Subject:
        sim/cris: Fix references to cgen cpu directory

Testsuite log (gdb.sum and gdb.log) URL(s):
        <http://gdb-build.sergiodj.net/results/Debian-s390x-native-gdbserver-m64/23/23ebf37881dda7fcf9dd86125705a30b6e2084ce/>

*** Diff to previous build ***
============================
PASS -> KFAIL: gdb.threads/process-dies-while-handling-bp.exp: non_stop=off: cond_bp_target=1: inferior 1 exited
PASS -> KFAIL: gdb.threads/process-dies-while-handling-bp.exp: non_stop=on: cond_bp_target=0: inferior 1 exited
============================


*** Complete list of XFAILs for this builder ***

To obtain the list of XFAIL tests for this builder, go to:

        <https://git.sergiodj.net/gdb-xfails.git/tree/xfails/Debian-s390x-native-gdbserver-m64/xfails/master/xfail?id=19e746c0>

You can also see a pretty-printed version of the list, with more information
about each XFAIL, by going to:

        <https://git.sergiodj.net/gdb-xfails.git/tree/xfails/Debian-s390x-native-gdbserver-m64/xfails/master/xfail.table?id=19e746c0>



Reply | Threaded
Open this post in threaded view
|

Failures on Fedora-x86_64-cc-with-index, branch master

sergiodj+buildbot-2
In reply to this post by sergiodj+buildbot-2
Buildslave:
        fedora-x86-64-2

Full Build URL:
        <http://gdb-build.sergiodj.net/builders/Fedora-x86_64-cc-with-index/builds/11516>

Commit(s) tested:
        23ebf37881dda7fcf9dd86125705a30b6e2084ce

Author(s) (in the same order as the commits):
        Andrew Burgess <[hidden email]>

Subject:
        sim/cris: Fix references to cgen cpu directory

Testsuite log (gdb.sum and gdb.log) URL(s):
        <http://gdb-build.sergiodj.net/results/Fedora-x86_64-cc-with-index/23/23ebf37881dda7fcf9dd86125705a30b6e2084ce/>

*** Diff to previous build ***
============================
PASS -> KFAIL: gdb.threads/non-ldr-exit.exp: program exits normally
PASS -> KFAIL: gdb.threads/process-dies-while-handling-bp.exp: non_stop=off: cond_bp_target=0: inferior 1 exited
PASS -> KFAIL: gdb.threads/process-dies-while-handling-bp.exp: non_stop=on: cond_bp_target=0: inferior 1 exited
============================


*** Complete list of XFAILs for this builder ***

To obtain the list of XFAIL tests for this builder, go to:

        <https://git.sergiodj.net/gdb-xfails.git/tree/xfails/Fedora-x86_64-cc-with-index/xfails/master/xfail?id=13939aff>

You can also see a pretty-printed version of the list, with more information
about each XFAIL, by going to:

        <https://git.sergiodj.net/gdb-xfails.git/tree/xfails/Fedora-x86_64-cc-with-index/xfails/master/xfail.table?id=13939aff>



Reply | Threaded
Open this post in threaded view
|

Failures on Debian-s390x-m64, branch master

sergiodj+buildbot-2
In reply to this post by sergiodj+buildbot-2
Buildslave:
        debian-jessie-s390x-1

Full Build URL:
        <http://gdb-build.sergiodj.net/builders/Debian-s390x-m64/builds/7007>

Commit(s) tested:
        23ebf37881dda7fcf9dd86125705a30b6e2084ce

Author(s) (in the same order as the commits):
        Andrew Burgess <[hidden email]>

Subject:
        sim/cris: Fix references to cgen cpu directory

Testsuite log (gdb.sum and gdb.log) URL(s):
        <http://gdb-build.sergiodj.net/results/Debian-s390x-m64/23/23ebf37881dda7fcf9dd86125705a30b6e2084ce/>

*** Diff to previous build ***
============================
PASS -> KFAIL: gdb.threads/process-dies-while-handling-bp.exp: non_stop=on: cond_bp_target=0: inferior 1 exited
============================


*** Complete list of XFAILs for this builder ***

To obtain the list of XFAIL tests for this builder, go to:

        <https://git.sergiodj.net/gdb-xfails.git/tree/xfails/Debian-s390x-m64/xfails/master/xfail?id=e26baaf6>

You can also see a pretty-printed version of the list, with more information
about each XFAIL, by going to:

        <https://git.sergiodj.net/gdb-xfails.git/tree/xfails/Debian-s390x-m64/xfails/master/xfail.table?id=e26baaf6>



Reply | Threaded
Open this post in threaded view
|

Failures on Ubuntu-Aarch64-native-extended-gdbserver-m64, branch master

sergiodj+buildbot-2
In reply to this post by sergiodj+buildbot-2
Buildslave:
        ubuntu16-aarch64

Full Build URL:
        <http://gdb-build.sergiodj.net/builders/Ubuntu-Aarch64-native-extended-gdbserver-m64/builds/243>

Commit(s) tested:
        23ebf37881dda7fcf9dd86125705a30b6e2084ce

Author(s) (in the same order as the commits):
        Andrew Burgess <[hidden email]>

Subject:
        sim/cris: Fix references to cgen cpu directory

Testsuite log (gdb.sum and gdb.log) URL(s):
        <http://gdb-build.sergiodj.net/results/Ubuntu-Aarch64-native-extended-gdbserver-m64/23/23ebf37881dda7fcf9dd86125705a30b6e2084ce/>




Reply | Threaded
Open this post in threaded view
|

Failures on Fedora-x86_64-native-extended-gdbserver-m64, branch master

sergiodj+buildbot-2
In reply to this post by sergiodj+buildbot-2
Buildslave:
        fedora-x86-64-3

Full Build URL:
        <http://gdb-build.sergiodj.net/builders/Fedora-x86_64-native-extended-gdbserver-m64/builds/11552>

Commit(s) tested:
        23ebf37881dda7fcf9dd86125705a30b6e2084ce

Author(s) (in the same order as the commits):
        Andrew Burgess <[hidden email]>

Subject:
        sim/cris: Fix references to cgen cpu directory

Testsuite log (gdb.sum and gdb.log) URL(s):
        <http://gdb-build.sergiodj.net/results/Fedora-x86_64-native-extended-gdbserver-m64/23/23ebf37881dda7fcf9dd86125705a30b6e2084ce/>

*** Diff to previous build ***
============================
UNRESOLVED -> FAIL: gdb.mi/mi-exec-run.exp: inferior-tty=main: mi=main: force-fail=1: run failure detected
UNRESOLVED -> FAIL: gdb.mi/mi-exec-run.exp: inferior-tty=main: mi=separate: force-fail=1: run failure detected
UNRESOLVED -> FAIL: gdb.mi/mi-exec-run.exp: inferior-tty=separate: mi=main: force-fail=1: run failure detected
UNRESOLVED -> FAIL: gdb.mi/mi-exec-run.exp: inferior-tty=separate: mi=separate: force-fail=1: run failure detected
PASS -> KFAIL: gdb.threads/process-dies-while-handling-bp.exp: non_stop=on: cond_bp_target=0: inferior 1 exited
============================


*** Complete list of XFAILs for this builder ***

To obtain the list of XFAIL tests for this builder, go to:

        <https://git.sergiodj.net/gdb-xfails.git/tree/xfails/Fedora-x86_64-native-extended-gdbserver-m64/xfails/master/xfail?id=d67b7e56>

You can also see a pretty-printed version of the list, with more information
about each XFAIL, by going to:

        <https://git.sergiodj.net/gdb-xfails.git/tree/xfails/Fedora-x86_64-native-extended-gdbserver-m64/xfails/master/xfail.table?id=d67b7e56>



Reply | Threaded
Open this post in threaded view
|

Failures on Fedora-x86_64-native-extended-gdbserver-m32, branch master

sergiodj+buildbot-2
In reply to this post by sergiodj+buildbot-2
Buildslave:
        fedora-x86-64-1

Full Build URL:
        <http://gdb-build.sergiodj.net/builders/Fedora-x86_64-native-extended-gdbserver-m32/builds/11281>

Commit(s) tested:
        23ebf37881dda7fcf9dd86125705a30b6e2084ce

Author(s) (in the same order as the commits):
        Andrew Burgess <[hidden email]>

Subject:
        sim/cris: Fix references to cgen cpu directory

Testsuite log (gdb.sum and gdb.log) URL(s):
        <http://gdb-build.sergiodj.net/results/Fedora-x86_64-native-extended-gdbserver-m32/23/23ebf37881dda7fcf9dd86125705a30b6e2084ce/>




Reply | Threaded
Open this post in threaded view
|

Failures on Fedora-x86_64-m64, branch master

sergiodj+buildbot-2
In reply to this post by sergiodj+buildbot-2
Buildslave:
        fedora-x86-64-2

Full Build URL:
        <http://gdb-build.sergiodj.net/builders/Fedora-x86_64-m64/builds/11656>

Commit(s) tested:
        23ebf37881dda7fcf9dd86125705a30b6e2084ce

Author(s) (in the same order as the commits):
        Andrew Burgess <[hidden email]>

Subject:
        sim/cris: Fix references to cgen cpu directory

Testsuite log (gdb.sum and gdb.log) URL(s):
        <http://gdb-build.sergiodj.net/results/Fedora-x86_64-m64/23/23ebf37881dda7fcf9dd86125705a30b6e2084ce/>

*** Diff to previous build ***
============================
PASS -> KFAIL: gdb.threads/non-ldr-exit.exp: program exits normally
PASS -> KFAIL: gdb.threads/process-dies-while-handling-bp.exp: non_stop=off: cond_bp_target=1: inferior 1 exited
PASS -> KFAIL: gdb.threads/process-dies-while-handling-bp.exp: non_stop=on: cond_bp_target=0: inferior 1 exited
============================


*** Complete list of XFAILs for this builder ***

To obtain the list of XFAIL tests for this builder, go to:

        <https://git.sergiodj.net/gdb-xfails.git/tree/xfails/Fedora-x86_64-m64/xfails/master/xfail?id=cdf6907c>

You can also see a pretty-printed version of the list, with more information
about each XFAIL, by going to:

        <https://git.sergiodj.net/gdb-xfails.git/tree/xfails/Fedora-x86_64-m64/xfails/master/xfail.table?id=cdf6907c>



Reply | Threaded
Open this post in threaded view
|

Failures on Fedora-x86_64-native-gdbserver-m64, branch master

sergiodj+buildbot-2
In reply to this post by sergiodj+buildbot-2
Buildslave:
        fedora-x86-64-4

Full Build URL:
        <http://gdb-build.sergiodj.net/builders/Fedora-x86_64-native-gdbserver-m64/builds/11517>

Commit(s) tested:
        23ebf37881dda7fcf9dd86125705a30b6e2084ce

Author(s) (in the same order as the commits):
        Andrew Burgess <[hidden email]>

Subject:
        sim/cris: Fix references to cgen cpu directory

Testsuite log (gdb.sum and gdb.log) URL(s):
        <http://gdb-build.sergiodj.net/results/Fedora-x86_64-native-gdbserver-m64/23/23ebf37881dda7fcf9dd86125705a30b6e2084ce/>

*** Diff to previous build ***
============================
new FAIL: gdb.base/execution-termios.exp: next: can't run to main
PASS -> KFAIL: gdb.threads/process-dies-while-handling-bp.exp: non_stop=off: cond_bp_target=0: inferior 1 exited
PASS -> KFAIL: gdb.threads/process-dies-while-handling-bp.exp: non_stop=on: cond_bp_target=1: inferior 1 exited
============================


*** Complete list of XFAILs for this builder ***

To obtain the list of XFAIL tests for this builder, go to:

        <https://git.sergiodj.net/gdb-xfails.git/tree/xfails/Fedora-x86_64-native-gdbserver-m64/xfails/master/xfail?id=db8de2a6>

You can also see a pretty-printed version of the list, with more information
about each XFAIL, by going to:

        <https://git.sergiodj.net/gdb-xfails.git/tree/xfails/Fedora-x86_64-native-gdbserver-m64/xfails/master/xfail.table?id=db8de2a6>



Reply | Threaded
Open this post in threaded view
|

Failures on Fedora-x86_64-m32, branch master

sergiodj+buildbot-2
In reply to this post by sergiodj+buildbot-2
Buildslave:
        fedora-x86-64-1

Full Build URL:
        <http://gdb-build.sergiodj.net/builders/Fedora-x86_64-m32/builds/11354>

Commit(s) tested:
        23ebf37881dda7fcf9dd86125705a30b6e2084ce

Author(s) (in the same order as the commits):
        Andrew Burgess <[hidden email]>

Subject:
        sim/cris: Fix references to cgen cpu directory

Testsuite log (gdb.sum and gdb.log) URL(s):
        <http://gdb-build.sergiodj.net/results/Fedora-x86_64-m32/23/23ebf37881dda7fcf9dd86125705a30b6e2084ce/>

*** Diff to previous build ***
============================
new FAIL: gdb.base/corefile.exp: core-file warning-free
PASS -> KFAIL: gdb.threads/non-ldr-exit.exp: program exits normally
PASS -> KFAIL: gdb.threads/process-dies-while-handling-bp.exp: non_stop=off: cond_bp_target=0: inferior 1 exited
PASS -> KFAIL: gdb.threads/process-dies-while-handling-bp.exp: non_stop=off: cond_bp_target=1: inferior 1 exited
============================


*** Complete list of XFAILs for this builder ***

To obtain the list of XFAIL tests for this builder, go to:

        <https://git.sergiodj.net/gdb-xfails.git/tree/xfails/Fedora-x86_64-m32/xfails/master/xfail?id=4e4add6c>

You can also see a pretty-printed version of the list, with more information
about each XFAIL, by going to:

        <https://git.sergiodj.net/gdb-xfails.git/tree/xfails/Fedora-x86_64-m32/xfails/master/xfail.table?id=4e4add6c>



Reply | Threaded
Open this post in threaded view
|

Failures on Ubuntu-Aarch64-native-gdbserver-m64, branch master

sergiodj+buildbot-2
In reply to this post by sergiodj+buildbot-2
Buildslave:
        ubuntu16-aarch64

Full Build URL:
        <http://gdb-build.sergiodj.net/builders/Ubuntu-Aarch64-native-gdbserver-m64/builds/4612>

Commit(s) tested:
        23ebf37881dda7fcf9dd86125705a30b6e2084ce

Author(s) (in the same order as the commits):
        Andrew Burgess <[hidden email]>

Subject:
        sim/cris: Fix references to cgen cpu directory

Testsuite log (gdb.sum and gdb.log) URL(s):
        <http://gdb-build.sergiodj.net/results/Ubuntu-Aarch64-native-gdbserver-m64/23/23ebf37881dda7fcf9dd86125705a30b6e2084ce/>




Reply | Threaded
Open this post in threaded view
|

*** COMPILATION FAILED *** Failures on Ubuntu-Aarch64-m64, branch master *** BREAKAGE ***

sergiodj+buildbot-2
In reply to this post by sergiodj+buildbot-2
Buildslave:
        ubuntu16-aarch64

Full Build URL:
        <http://gdb-build.sergiodj.net/builders/Ubuntu-Aarch64-m64/builds/4680>

Commit(s) tested:
        23ebf37881dda7fcf9dd86125705a30b6e2084ce

Author(s) (in the same order as the commits):
        Andrew Burgess <[hidden email]>

Subject:
        sim/cris: Fix references to cgen cpu directory

Testsuite log (gdb.sum and gdb.log) URL(s):
        <http://gdb-build.sergiodj.net/results/Ubuntu-Aarch64-m64/23/23ebf37881dda7fcf9dd86125705a30b6e2084ce/>

*** Failed to compiled GDB.  ***
============================

+++ The full log is too big to be posted here.
+++ These are the last 100 lines of it.

  CXX    ser-unix.o
  CXX    serial.o
  CXX    sh-linux-tdep.o
  CXX    sh-nbsd-tdep.o
  CXX    sh-tdep.o
  CXX    skip.o
  CXX    sol2-tdep.o
  CXX    solib-aix.o
  CXX    solib-darwin.o
  CXX    solib-dsbt.o
  CXX    solib-frv.o
  CXX    solib-spu.o
  CXX    solib-svr4.o
  CXX    solib-target.o
  CXX    solib.o
  CXX    source.o
  CXX    sparc-linux-tdep.o
  CXX    sparc-nbsd-tdep.o
  CXX    sparc-obsd-tdep.o
  CXX    sparc-ravenscar-thread.o
  CXX    sparc-sol2-tdep.o
  CXX    sparc-tdep.o
  CXX    sparc64-fbsd-tdep.o
  CXX    sparc64-linux-tdep.o
  CXX    sparc64-nbsd-tdep.o
  CXX    sparc64-obsd-tdep.o
  CXX    sparc64-sol2-tdep.o
  CXX    sparc64-tdep.o
  CXX    spu-multiarch.o
  CXX    spu-tdep.o
  CXX    stabsread.o
  CXX    stack.o
  CXX    stap-probe.o
  CXX    std-regs.o
  CXX    symfile-debug.o
  CXX    symfile-mem.o
  CXX    symfile.o
  CXX    symmisc.o
  CXX    symtab.o
  CXX    target-dcache.o
  CXX    target-descriptions.o
  CXX    target-float.o
  CXX    target-memory.o
  CXX    target.o
  CXX    target/waitstatus.o
  CXX    test-target.o
  CXX    thread-fsm.o
  CXX    thread-iter.o
  CXX    thread.o
  CXX    tic6x-linux-tdep.o
  CXX    tic6x-tdep.o
  CXX    tid-parse.o
  CXX    tilegx-linux-tdep.o
  CXX    tilegx-tdep.o
  CXX    top.o
  CXX    tracefile-tfile.o
  CXX    tracefile.o
  CXX    tracepoint.o
  CXX    trad-frame.o
  CXX    tramp-frame.o
  CXX    typeprint.o
  CXX    ui-file.o
  CXX    ui-out.o
  CXX    unittests/array-view-selftests.o
  CXX    unittests/cli-utils-selftests.o
  CXX    unittests/common-utils-selftests.o
  CXX    unittests/copy_bitwise-selftests.o
  CXX    unittests/environ-selftests.o
  CXX    unittests/format_pieces-selftests.o
  CXX    unittests/function-view-selftests.o
  CXX    unittests/lookup_name_info-selftests.o
  CXX    unittests/memory-map-selftests.o
  CXX    unittests/memrange-selftests.o
  CXX    unittests/mkdir-recursive-selftests.o
  CXX    unittests/observable-selftests.o
  CXX    unittests/offset-type-selftests.o
  CXX    unittests/optional-selftests.o
  CXX    unittests/parse-connection-spec-selftests.o
  CXX    unittests/ptid-selftests.o
  CXX    unittests/rsp-low-selftests.o
  CXX    unittests/scoped_fd-selftests.o
  CXX    unittests/scoped_mmap-selftests.o
  CXX    unittests/scoped_restore-selftests.o
  CXX    unittests/string_view-selftests.o
  CXX    unittests/tracepoint-selftests.o
g++: internal compiler error: Segmentation fault (program cc1plus)
Please submit a full bug report,
with preprocessed source if appropriate.
See <file:///usr/share/doc/gcc-5/README.Bugs> for instructions.
Makefile:1632: recipe for target 'unittests/scoped_fd-selftests.o' failed
make[2]: *** [unittests/scoped_fd-selftests.o] Error 4
make[2]: *** Waiting for unfinished jobs....
  CXX    unittests/unpack-selftests.o
make[2]: Leaving directory '/home/gdb_buildbot/ubuntu16-aarch64/ubuntu-aarch64-m64/build/gdb'
Makefile:8792: recipe for target 'all-gdb' failed
make[1]: *** [all-gdb] Error 2
make[1]: Leaving directory '/home/gdb_buildbot/ubuntu16-aarch64/ubuntu-aarch64-m64/build'
Makefile:849: recipe for target 'all' failed
make: *** [all] Error 2
============================



Reply | Threaded
Open this post in threaded view
|

Failures on Fedora-x86_64-native-gdbserver-m32, branch master

sergiodj+buildbot-2
In reply to this post by sergiodj+buildbot-2
Buildslave:
        fedora-x86-64-3

Full Build URL:
        <http://gdb-build.sergiodj.net/builders/Fedora-x86_64-native-gdbserver-m32/builds/11287>

Commit(s) tested:
        23ebf37881dda7fcf9dd86125705a30b6e2084ce

Author(s) (in the same order as the commits):
        Andrew Burgess <[hidden email]>

Subject:
        sim/cris: Fix references to cgen cpu directory

Testsuite log (gdb.sum and gdb.log) URL(s):
        <http://gdb-build.sergiodj.net/results/Fedora-x86_64-native-gdbserver-m32/23/23ebf37881dda7fcf9dd86125705a30b6e2084ce/>

*** Diff to previous build ***
============================
new UNRESOLVED: gdb.mi/mi-break.exp: mi-mode=separate:
PASS -> KFAIL: gdb.threads/process-dies-while-handling-bp.exp: non_stop=on: cond_bp_target=1: inferior 1 exited
PASS -> FAIL: gdb.threads/watchthreads-reorder.exp: reorder1: continue a
PASS -> FAIL: gdb.threads/watchthreads-reorder.exp: reorder1: continue b
PASS -> FAIL: gdb.threads/watchthreads-reorder.exp: reorder1: continue to breakpoint: break-at-exit
PASS -> FAIL: gdb.threads/watchthreads-reorder.exp: reorder1: rwatch thread1_rwatch
PASS -> FAIL: gdb.threads/watchthreads-reorder.exp: reorder1: rwatch thread2_rwatch
PASS -> FAIL: gdb.threads/watchthreads-reorder.exp: reorder1: rwatch unused1_rwatch
PASS -> FAIL: gdb.threads/watchthreads-reorder.exp: reorder1: rwatch unused2_rwatch
new FAIL: gdb.threads/watchthreads-reorder.exp: reorder1: setting breakpoint at 377
============================


*** Complete list of XFAILs for this builder ***

To obtain the list of XFAIL tests for this builder, go to:

        <https://git.sergiodj.net/gdb-xfails.git/tree/xfails/Fedora-x86_64-native-gdbserver-m32/xfails/master/xfail?id=44db6fcc>

You can also see a pretty-printed version of the list, with more information
about each XFAIL, by going to:

        <https://git.sergiodj.net/gdb-xfails.git/tree/xfails/Fedora-x86_64-native-gdbserver-m32/xfails/master/xfail.table?id=44db6fcc>