[binutils-gdb] rx: Add target rx-*-linux.

classic Classic list List threaded Threaded
14 messages Options
Reply | Threaded
Open this post in threaded view
|

[binutils-gdb] rx: Add target rx-*-linux.

sergiodj+buildbot-2
*** TEST RESULTS FOR COMMIT 8d3c78e473c2af54c8117808f2459a408f9f6327 ***

Author: Yoshinori Sato <[hidden email]>
Branch: master
Commit: 8d3c78e473c2af54c8117808f2459a408f9f6327

rx: Add target rx-*-linux.

Reply | Threaded
Open this post in threaded view
|

Failures on Fedora-s390x-m64, branch master

sergiodj+buildbot-2
Buildslave:
        marist-fedora-s390x

Full Build URL:
        <http://gdb-build.sergiodj.net/builders/Fedora-s390x-m64/builds/10067>

Commit(s) tested:
        8d3c78e473c2af54c8117808f2459a408f9f6327

Author(s) (in the same order as the commits):
        Yoshinori Sato <[hidden email]>

Subject:
        rx: Add target rx-*-linux.

Testsuite log (gdb.sum and gdb.log) URL(s):
        <http://gdb-build.sergiodj.net/results/Fedora-s390x-m64/8d/8d3c78e473c2af54c8117808f2459a408f9f6327/>

*** Diff to previous build ***
============================
PASS -> KFAIL: gdb.threads/process-dies-while-handling-bp.exp: non_stop=off: cond_bp_target=0: inferior 1 exited
============================


*** Complete list of XFAILs for this builder ***

To obtain the list of XFAIL tests for this builder, go to:

        <https://git.sergiodj.net/gdb-xfails.git/tree/xfails/Fedora-s390x-m64/xfails/master/xfail?id=c150c6be>

You can also see a pretty-printed version of the list, with more information
about each XFAIL, by going to:

        <https://git.sergiodj.net/gdb-xfails.git/tree/xfails/Fedora-s390x-m64/xfails/master/xfail.table?id=c150c6be>



Reply | Threaded
Open this post in threaded view
|

Failures on Fedora-i686, branch master

sergiodj+buildbot-2
In reply to this post by sergiodj+buildbot-2
Buildslave:
        fedora-x86-64-1

Full Build URL:
        <http://gdb-build.sergiodj.net/builders/Fedora-i686/builds/11427>

Commit(s) tested:
        8d3c78e473c2af54c8117808f2459a408f9f6327

Author(s) (in the same order as the commits):
        Yoshinori Sato <[hidden email]>

Subject:
        rx: Add target rx-*-linux.

Testsuite log (gdb.sum and gdb.log) URL(s):
        <http://gdb-build.sergiodj.net/results/Fedora-i686/8d/8d3c78e473c2af54c8117808f2459a408f9f6327/>

*** Diff to previous build ***
============================
PASS -> FAIL: gdb.python/py-mi-var-info-path-expression.exp: -var-list-children c1
PASS -> FAIL: gdb.python/py-mi-var-info-path-expression.exp: -var-list-children c1.car
PASS -> FAIL: gdb.python/py-mi-var-info-path-expression.exp: -var-list-children c1.car.atom
PASS -> FAIL: gdb.python/py-mi-var-info-path-expression.exp: -var-list-children c1.cdr
PASS -> UNRESOLVED: gdb.python/py-mi-var-info-path-expression.exp: load python file
PASS -> KFAIL: gdb.threads/process-dies-while-handling-bp.exp: non_stop=on: cond_bp_target=1: inferior 1 exited
============================


*** Complete list of XFAILs for this builder ***

To obtain the list of XFAIL tests for this builder, go to:

        <https://git.sergiodj.net/gdb-xfails.git/tree/xfails/Fedora-i686/xfails/master/xfail?id=2784a080>

You can also see a pretty-printed version of the list, with more information
about each XFAIL, by going to:

        <https://git.sergiodj.net/gdb-xfails.git/tree/xfails/Fedora-i686/xfails/master/xfail.table?id=2784a080>



Reply | Threaded
Open this post in threaded view
|

Failures on Fedora-x86_64-cc-with-index, branch master

sergiodj+buildbot-2
In reply to this post by sergiodj+buildbot-2
Buildslave:
        fedora-x86-64-3

Full Build URL:
        <http://gdb-build.sergiodj.net/builders/Fedora-x86_64-cc-with-index/builds/11341>

Commit(s) tested:
        8d3c78e473c2af54c8117808f2459a408f9f6327

Author(s) (in the same order as the commits):
        Yoshinori Sato <[hidden email]>

Subject:
        rx: Add target rx-*-linux.

Testsuite log (gdb.sum and gdb.log) URL(s):
        <http://gdb-build.sergiodj.net/results/Fedora-x86_64-cc-with-index/8d/8d3c78e473c2af54c8117808f2459a408f9f6327/>

*** Diff to previous build ***
============================
PASS -> KFAIL: gdb.threads/non-ldr-exit.exp: program exits normally
============================


*** Complete list of XFAILs for this builder ***

To obtain the list of XFAIL tests for this builder, go to:

        <https://git.sergiodj.net/gdb-xfails.git/tree/xfails/Fedora-x86_64-cc-with-index/xfails/master/xfail?id=353d7162>

You can also see a pretty-printed version of the list, with more information
about each XFAIL, by going to:

        <https://git.sergiodj.net/gdb-xfails.git/tree/xfails/Fedora-x86_64-cc-with-index/xfails/master/xfail.table?id=353d7162>



Reply | Threaded
Open this post in threaded view
|

Failures on RHEL-s390x-m64, branch master

sergiodj+buildbot-2
In reply to this post by sergiodj+buildbot-2
Buildslave:
        rhel-7_1-s390x-1

Full Build URL:
        <http://gdb-build.sergiodj.net/builders/RHEL-s390x-m64/builds/8742>

Commit(s) tested:
        8d3c78e473c2af54c8117808f2459a408f9f6327

Author(s) (in the same order as the commits):
        Yoshinori Sato <[hidden email]>

Subject:
        rx: Add target rx-*-linux.

Testsuite log (gdb.sum and gdb.log) URL(s):
        <http://gdb-build.sergiodj.net/results/RHEL-s390x-m64/8d/8d3c78e473c2af54c8117808f2459a408f9f6327/>

*** Diff to previous build ***
============================
PASS -> UNRESOLVED: gdb.multi/multi-term-settings.exp: inf1_how=tty: inf2_how=attach: continue
PASS -> FAIL: gdb.threads/gcore-stale-thread.exp: exited thread is current due to non-stop
PASS -> FAIL: gdb.threads/gcore-stale-thread.exp: save a corefile
new FAIL: gdb.threads/interrupt-while-step-over.exp: displaced-stepping=off: couldn't run to all_started
PASS -> KFAIL: gdb.threads/process-dies-while-handling-bp.exp: non_stop=off: cond_bp_target=0: inferior 1 exited
new FAIL: gdb.threads/pthreads.exp: after continue: continue until common routine run 15 times
PASS -> FAIL: gdb.threads/pthreads.exp: check backtrace from main thread
PASS -> FAIL: gdb.threads/signal-while-stepping-over-bp-other-thread.exp: continue to breakpoint: run to wait-thread-2 breakpoint
PASS -> FAIL: gdb.threads/watchpoint-fork.exp: child: singlethreaded: breakpoint after the first fork
PASS -> FAIL: gdb.threads/watchpoint-fork.exp: child: singlethreaded: watchpoint after the second fork
PASS -> FAIL: gdb.threads/watchpoint-fork.exp: parent: multithreaded: multithreaded watchpoints work at A
============================


*** Complete list of XFAILs for this builder ***

To obtain the list of XFAIL tests for this builder, go to:

        <https://git.sergiodj.net/gdb-xfails.git/tree/xfails/RHEL-s390x-m64/xfails/master/xfail?id=f63d7267>

You can also see a pretty-printed version of the list, with more information
about each XFAIL, by going to:

        <https://git.sergiodj.net/gdb-xfails.git/tree/xfails/RHEL-s390x-m64/xfails/master/xfail.table?id=f63d7267>



Reply | Threaded
Open this post in threaded view
|

Failures on Fedora-x86_64-native-gdbserver-m64, branch master

sergiodj+buildbot-2
In reply to this post by sergiodj+buildbot-2
Buildslave:
        fedora-x86-64-3

Full Build URL:
        <http://gdb-build.sergiodj.net/builders/Fedora-x86_64-native-gdbserver-m64/builds/11343>

Commit(s) tested:
        8d3c78e473c2af54c8117808f2459a408f9f6327

Author(s) (in the same order as the commits):
        Yoshinori Sato <[hidden email]>

Subject:
        rx: Add target rx-*-linux.

Testsuite log (gdb.sum and gdb.log) URL(s):
        <http://gdb-build.sergiodj.net/results/Fedora-x86_64-native-gdbserver-m64/8d/8d3c78e473c2af54c8117808f2459a408f9f6327/>

*** Diff to previous build ***
============================
new UNRESOLVED: gdb.mi/mi-break.exp: mi-mode=separate:
============================


*** Complete list of XFAILs for this builder ***

To obtain the list of XFAIL tests for this builder, go to:

        <https://git.sergiodj.net/gdb-xfails.git/tree/xfails/Fedora-x86_64-native-gdbserver-m64/xfails/master/xfail?id=f8a0ccf0>

You can also see a pretty-printed version of the list, with more information
about each XFAIL, by going to:

        <https://git.sergiodj.net/gdb-xfails.git/tree/xfails/Fedora-x86_64-native-gdbserver-m64/xfails/master/xfail.table?id=f8a0ccf0>



Reply | Threaded
Open this post in threaded view
|

Failures on Fedora-x86_64-m64, branch master

sergiodj+buildbot-2
In reply to this post by sergiodj+buildbot-2
Buildslave:
        fedora-x86-64-4

Full Build URL:
        <http://gdb-build.sergiodj.net/builders/Fedora-x86_64-m64/builds/11476>

Commit(s) tested:
        8d3c78e473c2af54c8117808f2459a408f9f6327

Author(s) (in the same order as the commits):
        Yoshinori Sato <[hidden email]>

Subject:
        rx: Add target rx-*-linux.

Testsuite log (gdb.sum and gdb.log) URL(s):
        <http://gdb-build.sergiodj.net/results/Fedora-x86_64-m64/8d/8d3c78e473c2af54c8117808f2459a408f9f6327/>

*** Diff to previous build ***
============================
PASS -> KFAIL: gdb.threads/process-dies-while-handling-bp.exp: non_stop=off: cond_bp_target=1: inferior 1 exited
============================


*** Complete list of XFAILs for this builder ***

To obtain the list of XFAIL tests for this builder, go to:

        <https://git.sergiodj.net/gdb-xfails.git/tree/xfails/Fedora-x86_64-m64/xfails/master/xfail?id=429f8aa3>

You can also see a pretty-printed version of the list, with more information
about each XFAIL, by going to:

        <https://git.sergiodj.net/gdb-xfails.git/tree/xfails/Fedora-x86_64-m64/xfails/master/xfail.table?id=429f8aa3>



Reply | Threaded
Open this post in threaded view
|

Failures on Fedora-x86_64-native-extended-gdbserver-m32, branch master

sergiodj+buildbot-2
In reply to this post by sergiodj+buildbot-2
Buildslave:
        fedora-x86-64-1

Full Build URL:
        <http://gdb-build.sergiodj.net/builders/Fedora-x86_64-native-extended-gdbserver-m32/builds/11105>

Commit(s) tested:
        8d3c78e473c2af54c8117808f2459a408f9f6327

Author(s) (in the same order as the commits):
        Yoshinori Sato <[hidden email]>

Subject:
        rx: Add target rx-*-linux.

Testsuite log (gdb.sum and gdb.log) URL(s):
        <http://gdb-build.sergiodj.net/results/Fedora-x86_64-native-extended-gdbserver-m32/8d/8d3c78e473c2af54c8117808f2459a408f9f6327/>




Reply | Threaded
Open this post in threaded view
|

Failures on Fedora-x86_64-m32, branch master

sergiodj+buildbot-2
In reply to this post by sergiodj+buildbot-2
Buildslave:
        fedora-x86-64-3

Full Build URL:
        <http://gdb-build.sergiodj.net/builders/Fedora-x86_64-m32/builds/11180>

Commit(s) tested:
        8d3c78e473c2af54c8117808f2459a408f9f6327

Author(s) (in the same order as the commits):
        Yoshinori Sato <[hidden email]>

Subject:
        rx: Add target rx-*-linux.

Testsuite log (gdb.sum and gdb.log) URL(s):
        <http://gdb-build.sergiodj.net/results/Fedora-x86_64-m32/8d/8d3c78e473c2af54c8117808f2459a408f9f6327/>

*** Diff to previous build ***
============================
PASS -> KFAIL: gdb.threads/non-ldr-exit.exp: program exits normally
PASS -> KFAIL: gdb.threads/process-dies-while-handling-bp.exp: non_stop=off: cond_bp_target=0: inferior 1 exited
============================


*** Complete list of XFAILs for this builder ***

To obtain the list of XFAIL tests for this builder, go to:

        <https://git.sergiodj.net/gdb-xfails.git/tree/xfails/Fedora-x86_64-m32/xfails/master/xfail?id=252f4af6>

You can also see a pretty-printed version of the list, with more information
about each XFAIL, by going to:

        <https://git.sergiodj.net/gdb-xfails.git/tree/xfails/Fedora-x86_64-m32/xfails/master/xfail.table?id=252f4af6>



Reply | Threaded
Open this post in threaded view
|

Failures on Fedora-x86_64-native-gdbserver-m32, branch master

sergiodj+buildbot-2
In reply to this post by sergiodj+buildbot-2
Buildslave:
        fedora-x86-64-2

Full Build URL:
        <http://gdb-build.sergiodj.net/builders/Fedora-x86_64-native-gdbserver-m32/builds/11113>

Commit(s) tested:
        8d3c78e473c2af54c8117808f2459a408f9f6327

Author(s) (in the same order as the commits):
        Yoshinori Sato <[hidden email]>

Subject:
        rx: Add target rx-*-linux.

Testsuite log (gdb.sum and gdb.log) URL(s):
        <http://gdb-build.sergiodj.net/results/Fedora-x86_64-native-gdbserver-m32/8d/8d3c78e473c2af54c8117808f2459a408f9f6327/>

*** Diff to previous build ***
============================
PASS -> KFAIL: gdb.threads/process-dies-while-handling-bp.exp: non_stop=off: cond_bp_target=1: inferior 1 exited
============================


*** Complete list of XFAILs for this builder ***

To obtain the list of XFAIL tests for this builder, go to:

        <https://git.sergiodj.net/gdb-xfails.git/tree/xfails/Fedora-x86_64-native-gdbserver-m32/xfails/master/xfail?id=a94ee872>

You can also see a pretty-printed version of the list, with more information
about each XFAIL, by going to:

        <https://git.sergiodj.net/gdb-xfails.git/tree/xfails/Fedora-x86_64-native-gdbserver-m32/xfails/master/xfail.table?id=a94ee872>



Reply | Threaded
Open this post in threaded view
|

*** COMPILATION FAILED *** Failures on Ubuntu-Aarch64-native-extended-gdbserver-m64, branch master *** BREAKAGE ***

sergiodj+buildbot-2
In reply to this post by sergiodj+buildbot-2
Buildslave:
        ubuntu16-aarch64

Full Build URL:
        <http://gdb-build.sergiodj.net/builders/Ubuntu-Aarch64-native-extended-gdbserver-m64/builds/109>

Commit(s) tested:
        8d3c78e473c2af54c8117808f2459a408f9f6327

Author(s) (in the same order as the commits):
        Yoshinori Sato <[hidden email]>

Subject:
        rx: Add target rx-*-linux.

Testsuite log (gdb.sum and gdb.log) URL(s):
        <http://gdb-build.sergiodj.net/results/Ubuntu-Aarch64-native-extended-gdbserver-m64/8d/8d3c78e473c2af54c8117808f2459a408f9f6327/>

*** Failed to compiled GDB.  ***
============================

+++ The full log is too big to be posted here.
+++ These are the last 100 lines of it.

  gcc -c -DHAVE_CONFIG_H -g -D_GLIBCXX_DEBUG   -I. -I../../../../binutils-gdb/gdb/gdbserver/../../libiberty/../include  -W -Wall -Wwrite-strings -Wc++-compat -Wstrict-prototypes -pedantic  -D_GNU_SOURCE   ../../../../binutils-gdb/gdb/gdbserver/../../libiberty/setproctitle.c -o noasan/setproctitle.o; \
else true; fi
gcc -c -DHAVE_CONFIG_H -g -D_GLIBCXX_DEBUG   -I. -I../../../../binutils-gdb/gdb/gdbserver/../../libiberty/../include  -W -Wall -Wwrite-strings -Wc++-compat -Wstrict-prototypes -pedantic  -D_GNU_SOURCE ../../../../binutils-gdb/gdb/gdbserver/../../libiberty/xvasprintf.c -o xvasprintf.o
gcc -c -DHAVE_CONFIG_H -g -D_GLIBCXX_DEBUG   -I. -I../../../../binutils-gdb/gdb/gdbserver/../../libiberty/../include  -W -Wall -Wwrite-strings -Wc++-compat -Wstrict-prototypes -pedantic  -D_GNU_SOURCE ../../../../binutils-gdb/gdb/gdbserver/../../libiberty/setproctitle.c -o setproctitle.o
rm -f ./libiberty.a pic/./libiberty.a noasan/./libiberty.a
ar rc ./libiberty.a \
  ./regex.o ./cplus-dem.o ./cp-demangle.o ./md5.o ./sha1.o ./alloca.o ./argv.o ./choose-temp.o ./concat.o ./cp-demint.o ./crc32.o ./d-demangle.o ./dwarfnames.o ./dyn-string.o ./fdmatch.o ./fibheap.o ./filename_cmp.o ./floatformat.o ./fnmatch.o ./fopen_unlocked.o ./getopt.o ./getopt1.o ./getpwd.o ./getruntime.o ./hashtab.o ./hex.o ./lbasename.o ./lrealpath.o ./make-relative-prefix.o ./make-temp-file.o ./objalloc.o ./obstack.o ./partition.o ./pexecute.o ./physmem.o ./pex-common.o ./pex-one.o ./pex-unix.o ./vprintf-support.o ./rust-demangle.o ./safe-ctype.o ./simple-object.o ./simple-object-coff.o ./simple-object-elf.o ./simple-object-mach-o.o ./simple-object-xcoff.o ./sort.o ./spaces.o ./splay-tree.o ./stack-limit.o ./strerror.o ./strsignal.o ./timeval-utils.o ./unlink-if-ordinary.o ./xasprintf.o ./xatexit.o ./xexit.o ./xmalloc.o ./xmemdup.o ./xstrdup.o ./xstrerror.o ./xstrndup.o ./xvasprintf.o  ./setproctitle.o
ranlib ./libiberty.a
if [ x"" != x ]; then \
  cd pic; \
  ar rc ./libiberty.a \
    ./regex.o ./cplus-dem.o ./cp-demangle.o ./md5.o ./sha1.o ./alloca.o ./argv.o ./choose-temp.o ./concat.o ./cp-demint.o ./crc32.o ./d-demangle.o ./dwarfnames.o ./dyn-string.o ./fdmatch.o ./fibheap.o ./filename_cmp.o ./floatformat.o ./fnmatch.o ./fopen_unlocked.o ./getopt.o ./getopt1.o ./getpwd.o ./getruntime.o ./hashtab.o ./hex.o ./lbasename.o ./lrealpath.o ./make-relative-prefix.o ./make-temp-file.o ./objalloc.o ./obstack.o ./partition.o ./pexecute.o ./physmem.o ./pex-common.o ./pex-one.o ./pex-unix.o ./vprintf-support.o ./rust-demangle.o ./safe-ctype.o ./simple-object.o ./simple-object-coff.o ./simple-object-elf.o ./simple-object-mach-o.o ./simple-object-xcoff.o ./sort.o ./spaces.o ./splay-tree.o ./stack-limit.o ./strerror.o ./strsignal.o ./timeval-utils.o ./unlink-if-ordinary.o ./xasprintf.o ./xatexit.o ./xexit.o ./xmalloc.o ./xmemdup.o ./xstrdup.o ./xstrerror.o ./xstrndup.o ./xvasprintf.o  ./setproctitle.o; \
  ranlib ./libiberty.a; \
  cd ..; \
else true; fi; \
if [ x"" != x ]; then \
  cd noasan; \
  ar rc ./libiberty.a \
    ./regex.o ./cplus-dem.o ./cp-demangle.o ./md5.o ./sha1.o ./alloca.o ./argv.o ./choose-temp.o ./concat.o ./cp-demint.o ./crc32.o ./d-demangle.o ./dwarfnames.o ./dyn-string.o ./fdmatch.o ./fibheap.o ./filename_cmp.o ./floatformat.o ./fnmatch.o ./fopen_unlocked.o ./getopt.o ./getopt1.o ./getpwd.o ./getruntime.o ./hashtab.o ./hex.o ./lbasename.o ./lrealpath.o ./make-relative-prefix.o ./make-temp-file.o ./objalloc.o ./obstack.o ./partition.o ./pexecute.o ./physmem.o ./pex-common.o ./pex-one.o ./pex-unix.o ./vprintf-support.o ./rust-demangle.o ./safe-ctype.o ./simple-object.o ./simple-object-coff.o ./simple-object-elf.o ./simple-object-mach-o.o ./simple-object-xcoff.o ./sort.o ./spaces.o ./splay-tree.o ./stack-limit.o ./strerror.o ./strsignal.o ./timeval-utils.o ./unlink-if-ordinary.o ./xasprintf.o ./xatexit.o ./xexit.o ./xmalloc.o ./xmemdup.o ./xstrdup.o ./xstrerror.o ./xstrndup.o ./xvasprintf.o  ./setproctitle.o; \
  ranlib ./libiberty.a; \
  cd ..; \
else true; fi
make[6]: Leaving directory '/home/gdb_buildbot/ubuntu16-aarch64/ubuntu-aarch64-native-extended-gdbserver-m64/build/gdb/gdbserver/build-libiberty-gdbserver'
make[5]: Leaving directory '/home/gdb_buildbot/ubuntu16-aarch64/ubuntu-aarch64-native-extended-gdbserver-m64/build/gdb/gdbserver'
  CXX    aarch64-linux-hw-point.o
  CXX    aarch64-linux.o
  CXX    aarch64-sve-linux-ptrace.o
  CXX    aarch64.o
  CXX    arch/aarch64-insn.o
  CXX    arch/aarch64.o
  CXX    arch/arm.o
  CXX    arm-with-neon.o
  CXX    ax.o
  CXX    common/agent.o
  CXX    common/btrace-common.o
  CXX    common/buffer.o
  CXX    common/cleanups.o
  CXX    common/common-debug.o
  CXX    common/common-exceptions.o
  CXX    common/common-regcache.o
  CXX    common/common-utils.o
  CXX    common/environ.o
  CXX    common/errors.o
  CXX    common/fileio.o
  CXX    common/filestuff.o
  CXX    common/format.o
  CXX    common/gdb_tilde_expand.o
  CXX    common/gdb_vecs.o
  CXX    common/job-control.o
  CXX    common/netstuff.o
  CXX    common/new-op.o
  CXX    common/pathstuff.o
  CXX    common/posix-strerror.o
  CXX    common/print-utils.o
  CXX    common/ptid.o
  CXX    common/rsp-low.o
  CXX    common/selftest.o
  CXX    common/signals-state-save-restore.o
  CXX    common/signals.o
  CXX    common/tdesc.o
  CXX    common/vec.o
  CXX    common/xml-utils.o
  CXX    debug.o
  CXX    dll.o
  CXX    event-loop.o
  CXX    fork-child.o
  CXX    fork-inferior.o
  CXX    hostio-errno.o
  CXX    hostio.o
  CXX    inferiors.o
  CXX    linux-aarch32-low.o
  CXX    linux-aarch64-low.o
  CXX    linux-aarch64-tdesc-selftest.o
  CXX    linux-aarch64-tdesc.o
  CXX    linux-low.o
  CXX    linux-namespaces.o
  CXX    linux-osdata.o
  CXX    linux-personality.o
  CXX    linux-procfs.o
  CXX    linux-ptrace.o
g++: internal compiler error: Segmentation fault (program cc1plus)
Please submit a full bug report,
with preprocessed source if appropriate.
See <file:///usr/share/doc/gcc-5/README.Bugs> for instructions.
Makefile:613: recipe for target 'linux-namespaces.o' failed
make[4]: *** [linux-namespaces.o] Error 4
make[4]: *** Waiting for unfinished jobs....
make[4]: Leaving directory '/home/gdb_buildbot/ubuntu16-aarch64/ubuntu-aarch64-native-extended-gdbserver-m64/build/gdb/gdbserver'
Makefile:2014: recipe for target 'subdir_do' failed
make[3]: *** [subdir_do] Error 1
make[3]: Leaving directory '/home/gdb_buildbot/ubuntu16-aarch64/ubuntu-aarch64-native-extended-gdbserver-m64/build/gdb'
Makefile:1621: recipe for target 'all' failed
make[2]: *** [all] Error 2
make[2]: Leaving directory '/home/gdb_buildbot/ubuntu16-aarch64/ubuntu-aarch64-native-extended-gdbserver-m64/build/gdb'
Makefile:8792: recipe for target 'all-gdb' failed
make[1]: *** [all-gdb] Error 2
make[1]: Leaving directory '/home/gdb_buildbot/ubuntu16-aarch64/ubuntu-aarch64-native-extended-gdbserver-m64/build'
Makefile:849: recipe for target 'all' failed
make: *** [all] Error 2
============================



Reply | Threaded
Open this post in threaded view
|

Failures on Ubuntu-Aarch64-native-gdbserver-m64, branch master

sergiodj+buildbot-2
In reply to this post by sergiodj+buildbot-2
Buildslave:
        ubuntu16-aarch64

Full Build URL:
        <http://gdb-build.sergiodj.net/builders/Ubuntu-Aarch64-native-gdbserver-m64/builds/4478>

Commit(s) tested:
        8d3c78e473c2af54c8117808f2459a408f9f6327

Author(s) (in the same order as the commits):
        Yoshinori Sato <[hidden email]>

Subject:
        rx: Add target rx-*-linux.

Testsuite log (gdb.sum and gdb.log) URL(s):
        <http://gdb-build.sergiodj.net/results/Ubuntu-Aarch64-native-gdbserver-m64/8d/8d3c78e473c2af54c8117808f2459a408f9f6327/>




Reply | Threaded
Open this post in threaded view
|

Failures on Ubuntu-Aarch64-m64, branch master

sergiodj+buildbot-2
In reply to this post by sergiodj+buildbot-2
Buildslave:
        ubuntu16-aarch64

Full Build URL:
        <http://gdb-build.sergiodj.net/builders/Ubuntu-Aarch64-m64/builds/4546>

Commit(s) tested:
        8d3c78e473c2af54c8117808f2459a408f9f6327

Author(s) (in the same order as the commits):
        Yoshinori Sato <[hidden email]>

Subject:
        rx: Add target rx-*-linux.

Testsuite log (gdb.sum and gdb.log) URL(s):
        <http://gdb-build.sergiodj.net/results/Ubuntu-Aarch64-m64/8d/8d3c78e473c2af54c8117808f2459a408f9f6327/>

*** Diff to previous build ***
============================
PASS -> FAIL: gdb.threads/multi-create-ns-info-thr.exp: continue to breakpoint 30
============================


*** Complete list of XFAILs for this builder ***

To obtain the list of XFAIL tests for this builder, go to:

        <https://git.sergiodj.net/gdb-xfails.git/tree/xfails/Ubuntu-Aarch64-m64/xfails/master/xfail?id=a78cdb4f>

You can also see a pretty-printed version of the list, with more information
about each XFAIL, by going to:

        <https://git.sergiodj.net/gdb-xfails.git/tree/xfails/Ubuntu-Aarch64-m64/xfails/master/xfail.table?id=a78cdb4f>



Reply | Threaded
Open this post in threaded view
|

Failures on Debian-s390x-m64, branch master

sergiodj+buildbot-2
In reply to this post by sergiodj+buildbot-2
Buildslave:
        debian-jessie-s390x-1

Full Build URL:
        <http://gdb-build.sergiodj.net/builders/Debian-s390x-m64/builds/6868>

Commit(s) tested:
        8d3c78e473c2af54c8117808f2459a408f9f6327

Author(s) (in the same order as the commits):
        Yoshinori Sato <[hidden email]>

Subject:
        rx: Add target rx-*-linux.

Testsuite log (gdb.sum and gdb.log) URL(s):
        <http://gdb-build.sergiodj.net/results/Debian-s390x-m64/8d/8d3c78e473c2af54c8117808f2459a408f9f6327/>

*** Diff to previous build ***
============================
PASS -> KFAIL: gdb.threads/process-dies-while-handling-bp.exp: non_stop=off: cond_bp_target=0: inferior 1 exited
============================


*** Complete list of XFAILs for this builder ***

To obtain the list of XFAIL tests for this builder, go to:

        <https://git.sergiodj.net/gdb-xfails.git/tree/xfails/Debian-s390x-m64/xfails/master/xfail?id=f595a40c>

You can also see a pretty-printed version of the list, with more information
about each XFAIL, by going to:

        <https://git.sergiodj.net/gdb-xfails.git/tree/xfails/Debian-s390x-m64/xfails/master/xfail.table?id=f595a40c>