[binutils-gdb] remote: Make vcont_builder a class

classic Classic list List threaded Threaded
10 messages Options
Reply | Threaded
Open this post in threaded view
|

[binutils-gdb] remote: Make vcont_builder a class

sergiodj+buildbot-2
*** TEST RESULTS FOR COMMIT f5db4863f51b83bc6b54504d61e1731011cfdec2 ***

Author: Pedro Alves <[hidden email]>
Branch: master
Commit: f5db4863f51b83bc6b54504d61e1731011cfdec2

remote: Make vcont_builder a class

gdb/ChangeLog:
2018-05-22  Pedro Alves  <[hidden email]>

        * remote.c (vcont_builder): Now a class.  Make all data members
        private.
        (vcont_builder) <vcont_builder, restart, flush, push_action>:
        Declare methods.
        (vcont_builder_restart): Rename to ...
        (vcont_builder::restart): ... this.
        (vcont_builder_flush): Rename to ...
        (vcont_builder::flush): ... this.
        (vcont_builder_push_action): Rename to ...
        (vcont_builder::push_action): ... this.
        (remote_target::commit_resume): Adjust.
Reply | Threaded
Open this post in threaded view
|

Failures on RHEL-s390x-m64, branch master

sergiodj+buildbot-2
Buildslave:
        rhel-7_1-s390x-1

Full Build URL:
        <http://gdb-build.sergiodj.net/builders/RHEL-s390x-m64/builds/7270>

Commit(s) tested:
        f5db4863f51b83bc6b54504d61e1731011cfdec2

Author(s) (in the same order as the commits):
        Pedro Alves <[hidden email]>

Subject:
        remote: Make vcont_builder a class

Testsuite log (gdb.sum and gdb.log) URL(s):
        <http://gdb-build.sergiodj.net/results/RHEL-s390x-m64/f5/f5db4863f51b83bc6b54504d61e1731011cfdec2/>

*** Diff to previous build ***
============================
PASS -> KFAIL: gdb.threads/process-dies-while-handling-bp.exp: non_stop=off: cond_bp_target=1: inferior 1 exited
============================


*** Complete list of XFAILs for this builder ***

To obtain the list of XFAIL tests for this builder, go to:

        <https://git.sergiodj.net/gdb-xfails.git/tree/xfails/RHEL-s390x-m64/xfails/master/xfail?id=6da72a5>

You can also see a pretty-printed version of the list, with more information
about each XFAIL, by going to:

        <https://git.sergiodj.net/gdb-xfails.git/tree/xfails/RHEL-s390x-m64/xfails/master/xfail.table?id=6da72a5>



Reply | Threaded
Open this post in threaded view
|

Failures on Debian-s390x-m64, branch master

sergiodj+buildbot-2
In reply to this post by sergiodj+buildbot-2
Buildslave:
        debian-jessie-s390x-1

Full Build URL:
        <http://gdb-build.sergiodj.net/builders/Debian-s390x-m64/builds/5399>

Commit(s) tested:
        f5db4863f51b83bc6b54504d61e1731011cfdec2

Author(s) (in the same order as the commits):
        Pedro Alves <[hidden email]>

Subject:
        remote: Make vcont_builder a class

Testsuite log (gdb.sum and gdb.log) URL(s):
        <http://gdb-build.sergiodj.net/results/Debian-s390x-m64/f5/f5db4863f51b83bc6b54504d61e1731011cfdec2/>

*** Diff to previous build ***
============================
PASS -> KFAIL: gdb.threads/non-ldr-exit.exp: program exits normally
PASS -> KFAIL: gdb.threads/process-dies-while-handling-bp.exp: non_stop=on: cond_bp_target=1: inferior 1 exited
============================


*** Complete list of XFAILs for this builder ***

To obtain the list of XFAIL tests for this builder, go to:

        <https://git.sergiodj.net/gdb-xfails.git/tree/xfails/Debian-s390x-m64/xfails/master/xfail?id=6c960dc>

You can also see a pretty-printed version of the list, with more information
about each XFAIL, by going to:

        <https://git.sergiodj.net/gdb-xfails.git/tree/xfails/Debian-s390x-m64/xfails/master/xfail.table?id=6c960dc>



Reply | Threaded
Open this post in threaded view
|

Failures on Debian-s390x-native-gdbserver-m64, branch master

sergiodj+buildbot-2
In reply to this post by sergiodj+buildbot-2
Buildslave:
        debian-jessie-s390x-1

Full Build URL:
        <http://gdb-build.sergiodj.net/builders/Debian-s390x-native-gdbserver-m64/builds/5447>

Commit(s) tested:
        f5db4863f51b83bc6b54504d61e1731011cfdec2

Author(s) (in the same order as the commits):
        Pedro Alves <[hidden email]>

Subject:
        remote: Make vcont_builder a class

Testsuite log (gdb.sum and gdb.log) URL(s):
        <http://gdb-build.sergiodj.net/results/Debian-s390x-native-gdbserver-m64/f5/f5db4863f51b83bc6b54504d61e1731011cfdec2/>

*** Diff to previous build ***
============================
PASS -> KFAIL: gdb.threads/process-dies-while-handling-bp.exp: non_stop=off: cond_bp_target=0: inferior 1 exited
============================


*** Complete list of XFAILs for this builder ***

To obtain the list of XFAIL tests for this builder, go to:

        <https://git.sergiodj.net/gdb-xfails.git/tree/xfails/Debian-s390x-native-gdbserver-m64/xfails/master/xfail?id=91933c9>

You can also see a pretty-printed version of the list, with more information
about each XFAIL, by going to:

        <https://git.sergiodj.net/gdb-xfails.git/tree/xfails/Debian-s390x-native-gdbserver-m64/xfails/master/xfail.table?id=91933c9>



Reply | Threaded
Open this post in threaded view
|

Failures on Fedora-i686, branch master

sergiodj+buildbot-2
In reply to this post by sergiodj+buildbot-2
Buildslave:
        fedora-x86-64-3

Full Build URL:
        <http://gdb-build.sergiodj.net/builders/Fedora-i686/builds/9813>

Commit(s) tested:
        f5db4863f51b83bc6b54504d61e1731011cfdec2

Author(s) (in the same order as the commits):
        Pedro Alves <[hidden email]>

Subject:
        remote: Make vcont_builder a class

Testsuite log (gdb.sum and gdb.log) URL(s):
        <http://gdb-build.sergiodj.net/results/Fedora-i686/f5/f5db4863f51b83bc6b54504d61e1731011cfdec2/>

*** Diff to previous build ***
============================
PASS -> KFAIL: gdb.threads/non-ldr-exit.exp: program exits normally
PASS -> KFAIL: gdb.threads/process-dies-while-handling-bp.exp: non_stop=on: cond_bp_target=1: inferior 1 exited
============================


*** Complete list of XFAILs for this builder ***

To obtain the list of XFAIL tests for this builder, go to:

        <https://git.sergiodj.net/gdb-xfails.git/tree/xfails/Fedora-i686/xfails/master/xfail?id=b24bdf1>

You can also see a pretty-printed version of the list, with more information
about each XFAIL, by going to:

        <https://git.sergiodj.net/gdb-xfails.git/tree/xfails/Fedora-i686/xfails/master/xfail.table?id=b24bdf1>



Reply | Threaded
Open this post in threaded view
|

Failures on Fedora-x86_64-native-extended-gdbserver-m64, branch master

sergiodj+buildbot-2
In reply to this post by sergiodj+buildbot-2
Buildslave:
        fedora-x86-64-2

Full Build URL:
        <http://gdb-build.sergiodj.net/builders/Fedora-x86_64-native-extended-gdbserver-m64/builds/9818>

Commit(s) tested:
        f5db4863f51b83bc6b54504d61e1731011cfdec2

Author(s) (in the same order as the commits):
        Pedro Alves <[hidden email]>

Subject:
        remote: Make vcont_builder a class

Testsuite log (gdb.sum and gdb.log) URL(s):
        <http://gdb-build.sergiodj.net/results/Fedora-x86_64-native-extended-gdbserver-m64/f5/f5db4863f51b83bc6b54504d61e1731011cfdec2/>

*** Diff to previous build ***
============================
PASS -> KFAIL: gdb.threads/process-dies-while-handling-bp.exp: non_stop=off: cond_bp_target=0: inferior 1 exited
============================


*** Complete list of XFAILs for this builder ***

To obtain the list of XFAIL tests for this builder, go to:

        <https://git.sergiodj.net/gdb-xfails.git/tree/xfails/Fedora-x86_64-native-extended-gdbserver-m64/xfails/master/xfail?id=d3d9c05>

You can also see a pretty-printed version of the list, with more information
about each XFAIL, by going to:

        <https://git.sergiodj.net/gdb-xfails.git/tree/xfails/Fedora-x86_64-native-extended-gdbserver-m64/xfails/master/xfail.table?id=d3d9c05>



Reply | Threaded
Open this post in threaded view
|

*** COMPILATION FAILED *** Failures on Fedora-x86_64-w64-mingw32, branch master *** BREAKAGE ***

sergiodj+buildbot-2
In reply to this post by sergiodj+buildbot-2
Buildslave:
        fedora-x86-64-2

Full Build URL:
        <http://gdb-build.sergiodj.net/builders/Fedora-x86_64-w64-mingw32/builds/1726>

Commit(s) tested:
        f5db4863f51b83bc6b54504d61e1731011cfdec2

Author(s) (in the same order as the commits):
        Pedro Alves <[hidden email]>

Subject:
        remote: Make vcont_builder a class

Testsuite log (gdb.sum and gdb.log) URL(s):
        <http://gdb-build.sergiodj.net/results/Fedora-x86_64-w64-mingw32/f5/f5db4863f51b83bc6b54504d61e1731011cfdec2/>

*** Failed to compiled GDB.  ***
============================

+++ The full log is too big to be posted here.
+++ These are the last 100 lines of it.

../../binutils-gdb/bfd/archive.c:1183:1: error: visibility attribute not supported in this configuration; ignored [-Werror=attributes]
 }
 ^
cc1: all warnings being treated as errors
../../binutils-gdb/bfd/archive.c: In function '_bfd_slurp_extended_name_table':
../../binutils-gdb/bfd/archive.c:1278:1: error: visibility attribute not supported in this configuration; ignored [-Werror=attributes]
 }
 ^
make[4]: *** [Makefile:1501: bfd.lo] Error 1
../../binutils-gdb/bfd/archive.c: In function '_bfd_archive_bsd_construct_extended_name_table':
../../binutils-gdb/bfd/archive.c:1464:1: error: visibility attribute not supported in this configuration; ignored [-Werror=attributes]
 }
 ^
../../binutils-gdb/bfd/archive.c: In function '_bfd_archive_coff_construct_extended_name_table':
../../binutils-gdb/bfd/archive.c:1476:1: error: visibility attribute not supported in this configuration; ignored [-Werror=attributes]
 }
 ^
../../binutils-gdb/bfd/archive.c: In function '_bfd_noarchive_construct_extended_name_table':
../../binutils-gdb/bfd/archive.c:1485:1: error: visibility attribute not supported in this configuration; ignored [-Werror=attributes]
 }
 ^
../../binutils-gdb/bfd/archive.c: In function '_bfd_construct_extended_name_table':
../../binutils-gdb/bfd/archive.c:1685:1: error: visibility attribute not supported in this configuration; ignored [-Werror=attributes]
 }
 ^
../../binutils-gdb/bfd/archive.c: In function '_bfd_archive_bsd44_construct_extended_name_table':
../../binutils-gdb/bfd/archive.c:1729:1: error: visibility attribute not supported in this configuration; ignored [-Werror=attributes]
 }
 ^
../../binutils-gdb/bfd/archive.c: In function '_bfd_generic_write_ar_hdr':
../../binutils-gdb/bfd/archive.c:1741:1: error: visibility attribute not supported in this configuration; ignored [-Werror=attributes]
 }
 ^
../../binutils-gdb/bfd/archive.c: In function '_bfd_bsd44_write_ar_hdr':
../../binutils-gdb/bfd/archive.c:1784:1: error: visibility attribute not supported in this configuration; ignored [-Werror=attributes]
 }
 ^
../../binutils-gdb/bfd/archive.c: In function '_bfd_noarchive_write_ar_hdr':
../../binutils-gdb/bfd/archive.c:1790:1: error: visibility attribute not supported in this configuration; ignored [-Werror=attributes]
 }
 ^
../../binutils-gdb/bfd/archive.c: In function 'bfd_generic_stat_arch_elt':
../../binutils-gdb/bfd/archive.c:1963:1: error: visibility attribute not supported in this configuration; ignored [-Werror=attributes]
 }
 ^
../../binutils-gdb/bfd/archive.c: In function 'bfd_dont_truncate_arname':
../../binutils-gdb/bfd/archive.c:2000:1: error: visibility attribute not supported in this configuration; ignored [-Werror=attributes]
 }
 ^
../../binutils-gdb/bfd/archive.c: In function 'bfd_bsd_truncate_arname':
../../binutils-gdb/bfd/archive.c:2023:1: error: visibility attribute not supported in this configuration; ignored [-Werror=attributes]
 }
 ^
../../binutils-gdb/bfd/archive.c: In function 'bfd_gnu_truncate_arname':
../../binutils-gdb/bfd/archive.c:2060:1: error: visibility attribute not supported in this configuration; ignored [-Werror=attributes]
 }
 ^
../../binutils-gdb/bfd/archive.c: In function '_bfd_noarchive_truncate_arname':
../../binutils-gdb/bfd/archive.c:2067:1: error: visibility attribute not supported in this configuration; ignored [-Werror=attributes]
 }
 ^
../../binutils-gdb/bfd/archive.c: In function '_bfd_write_archive_contents':
../../binutils-gdb/bfd/archive.c:2226:1: error: visibility attribute not supported in this configuration; ignored [-Werror=attributes]
 }
 ^
../../binutils-gdb/bfd/archive.c: In function '_bfd_compute_and_write_armap':
../../binutils-gdb/bfd/archive.c:2382:1: error: visibility attribute not supported in this configuration; ignored [-Werror=attributes]
 }
 ^
../../binutils-gdb/bfd/archive.c: In function '_bfd_bsd_write_armap':
../../binutils-gdb/bfd/archive.c:2538:1: error: visibility attribute not supported in this configuration; ignored [-Werror=attributes]
 }
 ^
../../binutils-gdb/bfd/archive.c: In function '_bfd_archive_bsd_update_armap_timestamp':
../../binutils-gdb/bfd/archive.c:2593:1: error: visibility attribute not supported in this configuration; ignored [-Werror=attributes]
 }
 ^
../../binutils-gdb/bfd/archive.c: In function '_bfd_coff_write_armap':
../../binutils-gdb/bfd/archive.c:2746:1: error: visibility attribute not supported in this configuration; ignored [-Werror=attributes]
 }
 ^
../../binutils-gdb/bfd/archive.c: In function '_bfd_noarchive_write_armap':
../../binutils-gdb/bfd/archive.c:2757:1: error: visibility attribute not supported in this configuration; ignored [-Werror=attributes]
 }
 ^
../../binutils-gdb/bfd/archive.c: In function '_bfd_archive_close_and_cleanup':
../../binutils-gdb/bfd/archive.c:2815:1: error: visibility attribute not supported in this configuration; ignored [-Werror=attributes]
 }
 ^
cc1: all warnings being treated as errors
make[4]: *** [Makefile:1501: archive.lo] Error 1
make[4]: Leaving directory '/home/gdb-buildbot-2/fedora-x86-64-2/fedora-x86-64-mingw32/build/bfd'
make[3]: *** [Makefile:1544: all-recursive] Error 1
make[3]: Leaving directory '/home/gdb-buildbot-2/fedora-x86-64-2/fedora-x86-64-mingw32/build/bfd'
make[2]: *** [Makefile:1077: all] Error 2
make[2]: Leaving directory '/home/gdb-buildbot-2/fedora-x86-64-2/fedora-x86-64-mingw32/build/bfd'
make[1]: *** [Makefile:2696: all-bfd] Error 2
make: *** [Makefile:857: all] Error 2
make[1]: Leaving directory '/home/gdb-buildbot-2/fedora-x86-64-2/fedora-x86-64-mingw32/build'
============================



Reply | Threaded
Open this post in threaded view
|

Failures on Fedora-x86_64-m64, branch master

sergiodj+buildbot-2
In reply to this post by sergiodj+buildbot-2
Buildslave:
        fedora-x86-64-4

Full Build URL:
        <http://gdb-build.sergiodj.net/builders/Fedora-x86_64-m64/builds/9832>

Commit(s) tested:
        f5db4863f51b83bc6b54504d61e1731011cfdec2

Author(s) (in the same order as the commits):
        Pedro Alves <[hidden email]>

Subject:
        remote: Make vcont_builder a class

Testsuite log (gdb.sum and gdb.log) URL(s):
        <http://gdb-build.sergiodj.net/results/Fedora-x86_64-m64/f5/f5db4863f51b83bc6b54504d61e1731011cfdec2/>

*** Diff to previous build ***
============================
PASS -> FAIL: gdb.base/info-os.exp: continue to breakpoint: Set breakpoint here
PASS -> FAIL: gdb.base/info-os.exp: get shared memory key
PASS -> FAIL: gdb.base/info-os.exp: get shared memory ID
PASS -> FAIL: gdb.base/info-os.exp: get semaphore key
PASS -> FAIL: gdb.base/info-os.exp: get semaphore ID
PASS -> FAIL: gdb.base/info-os.exp: get message queue key
PASS -> FAIL: gdb.base/info-os.exp: get message queue ID
PASS -> FAIL: gdb.base/info-os.exp: get socket port number
PASS -> FAIL: gdb.base/info-os.exp: get process list
PASS -> KFAIL: gdb.threads/multiple-successive-infcall.exp: thread=4: testing if call get_value
PASS -> KFAIL: gdb.threads/process-dies-while-handling-bp.exp: non_stop=off: cond_bp_target=0: inferior 1 exited
============================


*** Complete list of XFAILs for this builder ***

To obtain the list of XFAIL tests for this builder, go to:

        <https://git.sergiodj.net/gdb-xfails.git/tree/xfails/Fedora-x86_64-m64/xfails/master/xfail?id=370beeb>

You can also see a pretty-printed version of the list, with more information
about each XFAIL, by going to:

        <https://git.sergiodj.net/gdb-xfails.git/tree/xfails/Fedora-x86_64-m64/xfails/master/xfail.table?id=370beeb>



Reply | Threaded
Open this post in threaded view
|

Failures on Fedora-x86_64-native-gdbserver-m64, branch master

sergiodj+buildbot-2
In reply to this post by sergiodj+buildbot-2
Buildslave:
        fedora-x86-64-3

Full Build URL:
        <http://gdb-build.sergiodj.net/builders/Fedora-x86_64-native-gdbserver-m64/builds/9772>

Commit(s) tested:
        f5db4863f51b83bc6b54504d61e1731011cfdec2

Author(s) (in the same order as the commits):
        Pedro Alves <[hidden email]>

Subject:
        remote: Make vcont_builder a class

Testsuite log (gdb.sum and gdb.log) URL(s):
        <http://gdb-build.sergiodj.net/results/Fedora-x86_64-native-gdbserver-m64/f5/f5db4863f51b83bc6b54504d61e1731011cfdec2/>

*** Diff to previous build ***
============================
PASS -> FAIL: gdb.base/info-os.exp: continue to breakpoint: Set breakpoint here
PASS -> FAIL: gdb.base/info-os.exp: get shared memory key
PASS -> FAIL: gdb.base/info-os.exp: get shared memory ID
PASS -> FAIL: gdb.base/info-os.exp: get semaphore key
PASS -> FAIL: gdb.base/info-os.exp: get semaphore ID
PASS -> FAIL: gdb.base/info-os.exp: get message queue key
PASS -> FAIL: gdb.base/info-os.exp: get message queue ID
PASS -> FAIL: gdb.base/info-os.exp: get socket port number
PASS -> KFAIL: gdb.threads/process-dies-while-handling-bp.exp: non_stop=off: cond_bp_target=1: inferior 1 exited
============================


*** Complete list of XFAILs for this builder ***

To obtain the list of XFAIL tests for this builder, go to:

        <https://git.sergiodj.net/gdb-xfails.git/tree/xfails/Fedora-x86_64-native-gdbserver-m64/xfails/master/xfail?id=a5e321e>

You can also see a pretty-printed version of the list, with more information
about each XFAIL, by going to:

        <https://git.sergiodj.net/gdb-xfails.git/tree/xfails/Fedora-x86_64-native-gdbserver-m64/xfails/master/xfail.table?id=a5e321e>



Reply | Threaded
Open this post in threaded view
|

Failures on Fedora-x86_64-cc-with-index, branch master

sergiodj+buildbot-2
In reply to this post by sergiodj+buildbot-2
Buildslave:
        fedora-x86-64-1

Full Build URL:
        <http://gdb-build.sergiodj.net/builders/Fedora-x86_64-cc-with-index/builds/9727>

Commit(s) tested:
        f5db4863f51b83bc6b54504d61e1731011cfdec2

Author(s) (in the same order as the commits):
        Pedro Alves <[hidden email]>

Subject:
        remote: Make vcont_builder a class

Testsuite log (gdb.sum and gdb.log) URL(s):
        <http://gdb-build.sergiodj.net/results/Fedora-x86_64-cc-with-index/f5/f5db4863f51b83bc6b54504d61e1731011cfdec2/>

*** Diff to previous build ***
============================
PASS -> KFAIL: gdb.threads/multiple-successive-infcall.exp: thread=4: testing if call get_value
PASS -> KFAIL: gdb.threads/process-dies-while-handling-bp.exp: non_stop=on: cond_bp_target=1: inferior 1 exited
PASS -> KFAIL: gdb.threads/process-dies-while-handling-bp.exp: non_stop=off: cond_bp_target=1: inferior 1 exited
============================


*** Complete list of XFAILs for this builder ***

To obtain the list of XFAIL tests for this builder, go to:

        <https://git.sergiodj.net/gdb-xfails.git/tree/xfails/Fedora-x86_64-cc-with-index/xfails/master/xfail?id=6ab5eec>

You can also see a pretty-printed version of the list, with more information
about each XFAIL, by going to:

        <https://git.sergiodj.net/gdb-xfails.git/tree/xfails/Fedora-x86_64-cc-with-index/xfails/master/xfail.table?id=6ab5eec>