[binutils-gdb] gdb_compile_shlib: Only consider shlib= options when building executables

classic Classic list List threaded Threaded
11 messages Options
Reply | Threaded
Open this post in threaded view
|

[binutils-gdb] gdb_compile_shlib: Only consider shlib= options when building executables

sergiodj+buildbot-2
*** TEST RESULTS FOR COMMIT 6181e9c2c5ba252ac016f51903dc35d7bfbbca71 ***

Author: Simon Marchi <[hidden email]>
Branch: master
Commit: 6181e9c2c5ba252ac016f51903dc35d7bfbbca71

gdb_compile_shlib: Only consider shlib= options when building executables

Trying to use gdb_compile_shlib with the shlib= option to build a shared
library that depends on another shared library does not work as of
today.  See:

  https://sourceware.org/ml/gdb-patches/2017-10/msg00733.html

The problem is that building the lib is done in two steps, compilation
(.c -> .o) and linking (.o -> .so) and the shlib= options are passed to
both steps.  When compiling the object file (.o), it results in gcc
complaining:

  gcc: warning: .../solib-vanish-lib2.so: linker input file unused because linking not done

The first solution I came up with was to filter the options inside
gdb_compile_shlib to remove the shlib= options from the options we pass
when compiling the .o file.

I then thought it would be simpler to ignore the shlib= options in
gdb_compile when not building an executable (the executable category
includes the shared libraries).  For other compilation types (object
file, preprocess and generate assembly), it doesn't make sense to add
shared libraries to the source file list.

Regtested on the buildbot.

gdb/testsuite/ChangeLog:

        * lib/gdb.exp (gdb_compile): Ignore shlib= and shlib_load
        options when not creating an executable.
Reply | Threaded
Open this post in threaded view
|

Failures on Fedora-i686, branch master

sergiodj+buildbot-2
Buildslave:
        fedora-x86-64-4

Full Build URL:
        <http://gdb-build.sergiodj.net/builders/Fedora-i686/builds/8539>

Commit(s) tested:
        6181e9c2c5ba252ac016f51903dc35d7bfbbca71

Author(s) (in the same order as the commits):
        Simon Marchi <[hidden email]>

Subject:
        gdb_compile_shlib: Only consider shlib= options when building executables

Testsuite log (gdb.sum and gdb.log) URL(s):
        <http://gdb-build.sergiodj.net/results/Fedora-i686/61/6181e9c2c5ba252ac016f51903dc35d7bfbbca71/>

*** Diff to previous build ***
============================
PASS -> KFAIL: gdb.threads/process-dies-while-handling-bp.exp: non_stop=off: cond_bp_target=1: inferior 1 exited
============================


*** Complete list of XFAILs for this builder ***

To obtain the list of XFAIL tests for this builder, go to:

        <http://git.sergiodj.net/?p=gdb-xfails.git;a=blob;f=xfails/Fedora-i686/xfails/master/xfail;hb=e3bd253>

You can also see a pretty-printed version of the list, with more information
about each XFAIL, by going to:

        <http://git.sergiodj.net/?p=gdb-xfails.git;a=blob;f=xfails/Fedora-i686/xfails/master/xfail.table;hb=e3bd253>



Reply | Threaded
Open this post in threaded view
|

Failures on Fedora-x86_64-native-gdbserver-m32, branch master

sergiodj+buildbot-2
In reply to this post by sergiodj+buildbot-2
Buildslave:
        fedora-x86-64-3

Full Build URL:
        <http://gdb-build.sergiodj.net/builders/Fedora-x86_64-native-gdbserver-m32/builds/8500>

Commit(s) tested:
        6181e9c2c5ba252ac016f51903dc35d7bfbbca71

Author(s) (in the same order as the commits):
        Simon Marchi <[hidden email]>

Subject:
        gdb_compile_shlib: Only consider shlib= options when building executables

Testsuite log (gdb.sum and gdb.log) URL(s):
        <http://gdb-build.sergiodj.net/results/Fedora-x86_64-native-gdbserver-m32/61/6181e9c2c5ba252ac016f51903dc35d7bfbbca71/>

*** Diff to previous build ***
============================
PASS -> KFAIL: gdb.threads/process-dies-while-handling-bp.exp: non_stop=on: cond_bp_target=0: inferior 1 exited
============================


*** Complete list of XFAILs for this builder ***

To obtain the list of XFAIL tests for this builder, go to:

        <http://git.sergiodj.net/?p=gdb-xfails.git;a=blob;f=xfails/Fedora-x86_64-native-gdbserver-m32/xfails/master/xfail;hb=5d2ac30>

You can also see a pretty-printed version of the list, with more information
about each XFAIL, by going to:

        <http://git.sergiodj.net/?p=gdb-xfails.git;a=blob;f=xfails/Fedora-x86_64-native-gdbserver-m32/xfails/master/xfail.table;hb=5d2ac30>



Reply | Threaded
Open this post in threaded view
|

*** COMPILATION FAILED *** Failures on Fedora-x86_64-native-extended-gdbserver-m64, branch master *** BREAKAGE ***

sergiodj+buildbot-2
In reply to this post by sergiodj+buildbot-2
Buildslave:
        fedora-x86-64-2

Full Build URL:
        <http://gdb-build.sergiodj.net/builders/Fedora-x86_64-native-extended-gdbserver-m64/builds/8543>

Commit(s) tested:
        6181e9c2c5ba252ac016f51903dc35d7bfbbca71

Author(s) (in the same order as the commits):
        Simon Marchi <[hidden email]>

Subject:
        gdb_compile_shlib: Only consider shlib= options when building executables

Testsuite log (gdb.sum and gdb.log) URL(s):
        <http://gdb-build.sergiodj.net/results/Fedora-x86_64-native-extended-gdbserver-m64/61/6181e9c2c5ba252ac016f51903dc35d7bfbbca71/>

*** Failed to compiled GDB.  ***
============================

+++ The full log is too big to be posted here.
+++ These are the last 100 lines of it.

  -lmcheck  build-gnulib-gdbserver/import/libgnu.a build-libiberty-gdbserver/libiberty.a
rm -f libinproctrace.so
g++  -shared -fPIC -Wl,--soname=libinproctrace.so -Wl,--no-undefined -g -O2    -I. -I../../../binutils-gdb/gdb/gdbserver -I../../../binutils-gdb/gdb/gdbserver/../common -I../../../binutils-gdb/gdb/gdbserver/../regformats -I../../../binutils-gdb/gdb/gdbserver/.. -I../../../binutils-gdb/gdb/gdbserver/../../include -I../../../binutils-gdb/gdb/gdbserver/../gnulib/import -Ibuild-gnulib-gdbserver/import  -Wall -Wpointer-arith -Wno-unused -Wunused-value -Wunused-function -Wno-switch -Wno-char-subscripts -Wempty-body -Wunused-but-set-parameter -Wunused-but-set-variable -Wno-sign-compare -Wno-narrowing -Wno-error=maybe-uninitialized -Werror -DGDBSERVER \
 -Wl,--dynamic-list=../../../binutils-gdb/gdb/gdbserver/proc-service.list -o libinproctrace.so ax-ipa.o common-utils-ipa.o errors-ipa.o format-ipa.o print-utils-ipa.o regcache-ipa.o remote-utils-ipa.o rsp-low-ipa.o tdesc-ipa.o tracepoint-ipa.o utils-ipa.o vec-ipa.o linux-amd64-ipa.o linux-x86-tdesc-ipa.o arch/amd64-ipa.o -ldl -pthread
make[5]: Entering directory '/home/gdb-buildbot-2/fedora-x86-64-2/fedora-x86-64-native-extended-gdbserver/build/gdb/gdbserver'
make[6]: Entering directory '/home/gdb-buildbot-2/fedora-x86-64-2/fedora-x86-64-native-extended-gdbserver/build/gdb/gdbserver/build-gnulib-gdbserver'
make[7]: Entering directory '/home/gdb-buildbot-2/fedora-x86-64-2/fedora-x86-64-native-extended-gdbserver/build/gdb/gdbserver/build-gnulib-gdbserver'
make[8]: Entering directory '/home/gdb-buildbot-2/fedora-x86-64-2/fedora-x86-64-native-extended-gdbserver/build/gdb/gdbserver/build-gnulib-gdbserver/import'
make  all-recursive
make[9]: Entering directory '/home/gdb-buildbot-2/fedora-x86-64-2/fedora-x86-64-native-extended-gdbserver/build/gdb/gdbserver/build-gnulib-gdbserver/import'
make[10]: Entering directory '/home/gdb-buildbot-2/fedora-x86-64-2/fedora-x86-64-native-extended-gdbserver/build/gdb/gdbserver/build-gnulib-gdbserver/import'
make[10]: Nothing to be done for 'all-am'.
make[10]: Leaving directory '/home/gdb-buildbot-2/fedora-x86-64-2/fedora-x86-64-native-extended-gdbserver/build/gdb/gdbserver/build-gnulib-gdbserver/import'
make[9]: Leaving directory '/home/gdb-buildbot-2/fedora-x86-64-2/fedora-x86-64-native-extended-gdbserver/build/gdb/gdbserver/build-gnulib-gdbserver/import'
make[8]: Leaving directory '/home/gdb-buildbot-2/fedora-x86-64-2/fedora-x86-64-native-extended-gdbserver/build/gdb/gdbserver/build-gnulib-gdbserver/import'
make[7]: Leaving directory '/home/gdb-buildbot-2/fedora-x86-64-2/fedora-x86-64-native-extended-gdbserver/build/gdb/gdbserver/build-gnulib-gdbserver'
make[6]: Leaving directory '/home/gdb-buildbot-2/fedora-x86-64-2/fedora-x86-64-native-extended-gdbserver/build/gdb/gdbserver/build-gnulib-gdbserver'
make[6]: Entering directory '/home/gdb-buildbot-2/fedora-x86-64-2/fedora-x86-64-native-extended-gdbserver/build/gdb/gdbserver/build-libiberty-gdbserver'
make[7]: Entering directory '/home/gdb-buildbot-2/fedora-x86-64-2/fedora-x86-64-native-extended-gdbserver/build/gdb/gdbserver/build-libiberty-gdbserver/testsuite'
make[7]: Nothing to be done for 'all'.
make[7]: Leaving directory '/home/gdb-buildbot-2/fedora-x86-64-2/fedora-x86-64-native-extended-gdbserver/build/gdb/gdbserver/build-libiberty-gdbserver/testsuite'
make[6]: Leaving directory '/home/gdb-buildbot-2/fedora-x86-64-2/fedora-x86-64-native-extended-gdbserver/build/gdb/gdbserver/build-libiberty-gdbserver'
make[5]: Leaving directory '/home/gdb-buildbot-2/fedora-x86-64-2/fedora-x86-64-native-extended-gdbserver/build/gdb/gdbserver'
make[4]: Leaving directory '/home/gdb-buildbot-2/fedora-x86-64-2/fedora-x86-64-native-extended-gdbserver/build/gdb/gdbserver'
make[4]: Entering directory '/home/gdb-buildbot-2/fedora-x86-64-2/fedora-x86-64-native-extended-gdbserver/build/gdb/data-directory'
rm -rf ./syscalls
rm -rf ./python
mkdir ./syscalls
rm -rf ./guile
files='gdb/__init__.py gdb/FrameDecorator.py gdb/FrameIterator.py gdb/frames.py gdb/printing.py gdb/prompt.py gdb/types.py gdb/unwinder.py gdb/xmethod.py gdb/command/__init__.py gdb/command/explore.py gdb/command/frame_filters.py gdb/command/pretty_printers.py gdb/command/prompt.py gdb/command/type_printers.py gdb/command/unwinders.py gdb/command/xmethods.py gdb/function/__init__.py gdb/function/as_string.py gdb/function/caller_is.py gdb/function/strfns.py gdb/printer/__init__.py gdb/printer/bound_registers.py' ; \
if test "x$files" != x ; then \
  for file in $files ; do \
    dir=`echo "$file" | sed 's,/[^/]*$,,'` ; \
    /bin/sh ../../../binutils-gdb/gdb/data-directory/../../mkinstalldirs ./python/$dir ; \
    /usr/bin/install -c -m 644 ../../../binutils-gdb/gdb/data-directory/../python/lib/$file ./python/$dir ; \
  done ; \
fi
files='gdb-syscalls.dtd freebsd.xml aarch64-linux.xml amd64-linux.xml arm-linux.xml i386-linux.xml mips-n32-linux.xml mips-n64-linux.xml mips-o32-linux.xml ppc-linux.xml ppc64-linux.xml s390-linux.xml s390x-linux.xml sparc-linux.xml sparc64-linux.xml' ; \
for file in $files ; do \
  f=../../../binutils-gdb/gdb/data-directory/../syscalls/$file ; \
  if test -f $f ; then \
    /usr/bin/install -c -m 644 $f ./syscalls ; \
  fi ; \
done
if test "x./gdb.scm gdb/boot.scm gdb/experimental.scm gdb/init.scm gdb/iterator.scm gdb/printing.scm gdb/support.scm gdb/types.scm ./gdb.go gdb/experimental.go gdb/iterator.go gdb/printing.go gdb/support.go gdb/types.go" != x ; then \
  files='./gdb.scm gdb/boot.scm gdb/experimental.scm gdb/init.scm gdb/iterator.scm gdb/printing.scm gdb/support.scm gdb/types.scm' ; \
  for file in $files ; do \
    dir=`echo "$file" | sed 's,/[^/]*$,,'` ; \
    /bin/sh ../../../binutils-gdb/gdb/data-directory/../../mkinstalldirs ./guile/$dir ; \
    /usr/bin/install -c -m 644 ../../../binutils-gdb/gdb/data-directory/../guile/lib/$file ./guile/$dir ; \
  done ; \
  files='./gdb.go gdb/experimental.go gdb/iterator.go gdb/printing.go gdb/support.go gdb/types.go' ; \
  cd ./guile ; \
  for go in $files ; do \
    source="`echo $go | sed 's/\.go$/.scm/'`" ; \
    echo /usr/bin/guild compile  -Warity-mismatch -Wformat -Wunused-toplevel -L . -o "$go" "$source" ; \
    /usr/bin/guild compile  -Warity-mismatch -Wformat -Wunused-toplevel -L . -o "$go" "$source" || exit 1 ; \
  done ; \
fi
rm -rf ./system-gdbinit
mkdir ./system-gdbinit
files='elinos.py wrs-linux.py' ; \
for file in $files ; do \
  f=../../../binutils-gdb/gdb/data-directory/../system-gdbinit/$file ; \
  if test -f $f ; then \
    /usr/bin/install -c -m 644 $f ./system-gdbinit ; \
  fi ; \
done
mkdir -p -- ./guile/.
mkdir -p -- ./python/gdb
touch stamp-system-gdbinit
mkdir -p -- ./guile/gdb
touch stamp-syscalls
/usr/bin/guild compile -Warity-mismatch -Wformat -Wunused-toplevel -L . -o ./gdb.go ./gdb.scm
mkdir -p -- ./python/gdb/command
wrote `./gdb.go'
mkdir -p -- ./python/gdb/function
/usr/bin/guild compile -Warity-mismatch -Wformat -Wunused-toplevel -L . -o gdb/experimental.go gdb/experimental.scm
mkdir -p -- ./python/gdb/printer
touch stamp-python
wrote `gdb/experimental.go'
/usr/bin/guild compile -Warity-mismatch -Wformat -Wunused-toplevel -L . -o gdb/iterator.go gdb/iterator.scm
wrote `gdb/iterator.go'
/usr/bin/guild compile -Warity-mismatch -Wformat -Wunused-toplevel -L . -o gdb/printing.go gdb/printing.scm
wrote `gdb/printing.go'
/usr/bin/guild compile -Warity-mismatch -Wformat -Wunused-toplevel -L . -o gdb/support.go gdb/support.scm
wrote `gdb/support.go'
/usr/bin/guild compile -Warity-mismatch -Wformat -Wunused-toplevel -L . -o gdb/types.go gdb/types.scm
wrote `gdb/types.go'
touch stamp-guile
make[4]: fork: Resource temporarily unavailable
make[4]: Leaving directory '/home/gdb-buildbot-2/fedora-x86-64-2/fedora-x86-64-native-extended-gdbserver/build/gdb/data-directory'
make[3]: *** [Makefile:2022: subdir_do] Error 1
make[3]: Leaving directory '/home/gdb-buildbot-2/fedora-x86-64-2/fedora-x86-64-native-extended-gdbserver/build/gdb'
make[2]: *** [Makefile:1616: all] Error 2
make[2]: Leaving directory '/home/gdb-buildbot-2/fedora-x86-64-2/fedora-x86-64-native-extended-gdbserver/build/gdb'
make[1]: *** [Makefile:8793: all-gdb] Error 2
make[1]: Leaving directory '/home/gdb-buildbot-2/fedora-x86-64-2/fedora-x86-64-native-extended-gdbserver/build'
make: *** [Makefile:850: all] Error 2
============================



Reply | Threaded
Open this post in threaded view
|

Failures on Fedora-x86_64-native-extended-gdbserver-m32, branch master

sergiodj+buildbot-2
In reply to this post by sergiodj+buildbot-2
Buildslave:
        fedora-x86-64-4

Full Build URL:
        <http://gdb-build.sergiodj.net/builders/Fedora-x86_64-native-extended-gdbserver-m32/builds/8504>

Commit(s) tested:
        6181e9c2c5ba252ac016f51903dc35d7bfbbca71

Author(s) (in the same order as the commits):
        Simon Marchi <[hidden email]>

Subject:
        gdb_compile_shlib: Only consider shlib= options when building executables

Testsuite log (gdb.sum and gdb.log) URL(s):
        <http://gdb-build.sergiodj.net/results/Fedora-x86_64-native-extended-gdbserver-m32/61/6181e9c2c5ba252ac016f51903dc35d7bfbbca71/>

*** Diff to previous build ***
============================
PASS -> KFAIL: gdb.threads/process-dies-while-handling-bp.exp: non_stop=on: cond_bp_target=0: inferior 1 exited
============================


*** Complete list of XFAILs for this builder ***

To obtain the list of XFAIL tests for this builder, go to:

        <http://git.sergiodj.net/?p=gdb-xfails.git;a=blob;f=xfails/Fedora-x86_64-native-extended-gdbserver-m32/xfails/master/xfail;hb=4a056df>

You can also see a pretty-printed version of the list, with more information
about each XFAIL, by going to:

        <http://git.sergiodj.net/?p=gdb-xfails.git;a=blob;f=xfails/Fedora-x86_64-native-extended-gdbserver-m32/xfails/master/xfail.table;hb=4a056df>



Reply | Threaded
Open this post in threaded view
|

Failures on Fedora-x86_64-cc-with-index, branch master

sergiodj+buildbot-2
In reply to this post by sergiodj+buildbot-2
Buildslave:
        fedora-x86-64-3

Full Build URL:
        <http://gdb-build.sergiodj.net/builders/Fedora-x86_64-cc-with-index/builds/8453>

Commit(s) tested:
        6181e9c2c5ba252ac016f51903dc35d7bfbbca71

Author(s) (in the same order as the commits):
        Simon Marchi <[hidden email]>

Subject:
        gdb_compile_shlib: Only consider shlib= options when building executables

Testsuite log (gdb.sum and gdb.log) URL(s):
        <http://gdb-build.sergiodj.net/results/Fedora-x86_64-cc-with-index/61/6181e9c2c5ba252ac016f51903dc35d7bfbbca71/>

*** Diff to previous build ***
============================
PASS -> KFAIL: gdb.threads/process-dies-while-handling-bp.exp: non_stop=off: cond_bp_target=1: inferior 1 exited
============================


*** Complete list of XFAILs for this builder ***

To obtain the list of XFAIL tests for this builder, go to:

        <http://git.sergiodj.net/?p=gdb-xfails.git;a=blob;f=xfails/Fedora-x86_64-cc-with-index/xfails/master/xfail;hb=3e07033>

You can also see a pretty-printed version of the list, with more information
about each XFAIL, by going to:

        <http://git.sergiodj.net/?p=gdb-xfails.git;a=blob;f=xfails/Fedora-x86_64-cc-with-index/xfails/master/xfail.table;hb=3e07033>



Reply | Threaded
Open this post in threaded view
|

Failures on Ubuntu-AArch64-native-gdbserver-m64, branch master

sergiodj+buildbot-2
In reply to this post by sergiodj+buildbot-2
Buildslave:
        ubuntu-aarch64-1

Full Build URL:
        <http://gdb-build.sergiodj.net/builders/Ubuntu-AArch64-native-gdbserver-m64/builds/3927>

Commit(s) tested:
        6181e9c2c5ba252ac016f51903dc35d7bfbbca71

Author(s) (in the same order as the commits):
        Simon Marchi <[hidden email]>

Subject:
        gdb_compile_shlib: Only consider shlib= options when building executables

Testsuite log (gdb.sum and gdb.log) URL(s):
        <http://gdb-build.sergiodj.net/results/Ubuntu-AArch64-native-gdbserver-m64/61/6181e9c2c5ba252ac016f51903dc35d7bfbbca71/>

*** Diff to previous build ***
============================
PASS -> KFAIL: gdb.threads/process-dies-while-handling-bp.exp: non_stop=off: cond_bp_target=0: inferior 1 exited
============================


*** Complete list of XFAILs for this builder ***

To obtain the list of XFAIL tests for this builder, go to:

        <http://git.sergiodj.net/?p=gdb-xfails.git;a=blob;f=xfails/Ubuntu-AArch64-native-gdbserver-m64/xfails/master/xfail;hb=7b8f22d>

You can also see a pretty-printed version of the list, with more information
about each XFAIL, by going to:

        <http://git.sergiodj.net/?p=gdb-xfails.git;a=blob;f=xfails/Ubuntu-AArch64-native-gdbserver-m64/xfails/master/xfail.table;hb=7b8f22d>



Reply | Threaded
Open this post in threaded view
|

Failures on Ubuntu-AArch64-m64, branch master

sergiodj+buildbot-2
In reply to this post by sergiodj+buildbot-2
Buildslave:
        ubuntu-aarch64-1

Full Build URL:
        <http://gdb-build.sergiodj.net/builders/Ubuntu-AArch64-m64/builds/3953>

Commit(s) tested:
        6181e9c2c5ba252ac016f51903dc35d7bfbbca71

Author(s) (in the same order as the commits):
        Simon Marchi <[hidden email]>

Subject:
        gdb_compile_shlib: Only consider shlib= options when building executables

Testsuite log (gdb.sum and gdb.log) URL(s):
        <http://gdb-build.sergiodj.net/results/Ubuntu-AArch64-m64/61/6181e9c2c5ba252ac016f51903dc35d7bfbbca71/>

*** Diff to previous build ***
============================
PASS -> KFAIL: gdb.threads/process-dies-while-handling-bp.exp: non_stop=off: cond_bp_target=0: inferior 1 exited
============================


*** Complete list of XFAILs for this builder ***

To obtain the list of XFAIL tests for this builder, go to:

        <http://git.sergiodj.net/?p=gdb-xfails.git;a=blob;f=xfails/Ubuntu-AArch64-m64/xfails/master/xfail;hb=a85ec42>

You can also see a pretty-printed version of the list, with more information
about each XFAIL, by going to:

        <http://git.sergiodj.net/?p=gdb-xfails.git;a=blob;f=xfails/Ubuntu-AArch64-m64/xfails/master/xfail.table;hb=a85ec42>



Reply | Threaded
Open this post in threaded view
|

Failures on Ubuntu-AArch32-native-extended-gdbserver-m32, branch master

sergiodj+buildbot-2
In reply to this post by sergiodj+buildbot-2
Buildslave:
        ubuntu-trusty-aarch32-1

Full Build URL:
        <http://gdb-build.sergiodj.net/builders/Ubuntu-AArch32-native-extended-gdbserver-m32/builds/2539>

Commit(s) tested:
        6181e9c2c5ba252ac016f51903dc35d7bfbbca71

Author(s) (in the same order as the commits):
        Simon Marchi <[hidden email]>

Subject:
        gdb_compile_shlib: Only consider shlib= options when building executables

Testsuite log (gdb.sum and gdb.log) URL(s):
        <http://gdb-build.sergiodj.net/results/Ubuntu-AArch32-native-extended-gdbserver-m32/61/6181e9c2c5ba252ac016f51903dc35d7bfbbca71/>

*** Diff to previous build ***
============================
new KFAIL: gdb.base/step-over-syscall.exp: clone: displaced=on: single step over clone
new FAIL: gdb.threads/interrupt-while-step-over.exp: displaced-stepping=off: iter=12: wait for stops
new FAIL: gdb.threads/interrupt-while-step-over.exp: displaced-stepping=off: iter=15: wait for stops
PASS -> FAIL: gdb.threads/process-dies-while-detaching.exp: single-process: continue: killed outside: continue
============================


*** Complete list of XFAILs for this builder ***

FAILURE TO OBTAIN THE COMMIT FOR THE XFAIL LIST.  PLEASE CONTACT THE BUILDBOT ADMIN.



Reply | Threaded
Open this post in threaded view
|

Failures on Ubuntu-AArch32-native-gdbserver-m32, branch master

sergiodj+buildbot-2
In reply to this post by sergiodj+buildbot-2
Buildslave:
        ubuntu-trusty-aarch32-1

Full Build URL:
        <http://gdb-build.sergiodj.net/builders/Ubuntu-AArch32-native-gdbserver-m32/builds/2521>

Commit(s) tested:
        6181e9c2c5ba252ac016f51903dc35d7bfbbca71

Author(s) (in the same order as the commits):
        Simon Marchi <[hidden email]>

Subject:
        gdb_compile_shlib: Only consider shlib= options when building executables

Testsuite log (gdb.sum and gdb.log) URL(s):
        <http://gdb-build.sergiodj.net/results/Ubuntu-AArch32-native-gdbserver-m32/61/6181e9c2c5ba252ac016f51903dc35d7bfbbca71/>

*** Diff to previous build ***
============================
PASS -> KFAIL: gdb.threads/non-ldr-exit.exp: program exits normally
============================


*** Complete list of XFAILs for this builder ***

To obtain the list of XFAIL tests for this builder, go to:

        <http://git.sergiodj.net/?p=gdb-xfails.git;a=blob;f=xfails/Ubuntu-AArch32-native-gdbserver-m32/xfails/master/xfail;hb=>

You can also see a pretty-printed version of the list, with more information
about each XFAIL, by going to:

        <http://git.sergiodj.net/?p=gdb-xfails.git;a=blob;f=xfails/Ubuntu-AArch32-native-gdbserver-m32/xfails/master/xfail.table;hb=>



Reply | Threaded
Open this post in threaded view
|

Failures on Ubuntu-AArch32-m32, branch master

sergiodj+buildbot-2
In reply to this post by sergiodj+buildbot-2
Buildslave:
        ubuntu-trusty-aarch32-1

Full Build URL:
        <http://gdb-build.sergiodj.net/builders/Ubuntu-AArch32-m32/builds/2540>

Commit(s) tested:
        6181e9c2c5ba252ac016f51903dc35d7bfbbca71

Author(s) (in the same order as the commits):
        Simon Marchi <[hidden email]>

Subject:
        gdb_compile_shlib: Only consider shlib= options when building executables

Testsuite log (gdb.sum and gdb.log) URL(s):
        <http://gdb-build.sergiodj.net/results/Ubuntu-AArch32-m32/61/6181e9c2c5ba252ac016f51903dc35d7bfbbca71/>

*** Diff to previous build ***
============================
PASS -> KFAIL: gdb.threads/process-dies-while-handling-bp.exp: non_stop=off: cond_bp_target=1: inferior 1 exited
============================


*** Complete list of XFAILs for this builder ***

To obtain the list of XFAIL tests for this builder, go to:

        <http://git.sergiodj.net/?p=gdb-xfails.git;a=blob;f=xfails/Ubuntu-AArch32-m32/xfails/master/xfail;hb=>

You can also see a pretty-printed version of the list, with more information
about each XFAIL, by going to:

        <http://git.sergiodj.net/?p=gdb-xfails.git;a=blob;f=xfails/Ubuntu-AArch32-m32/xfails/master/xfail.table;hb=>