[binutils-gdb] gdb: Add --with-python-libdir to gdb's --configuration output

classic Classic list List threaded Threaded
11 messages Options
Reply | Threaded
Open this post in threaded view
|

[binutils-gdb] gdb: Add --with-python-libdir to gdb's --configuration output

Sourceware - gdb-testers mailing list
*** TEST RESULTS FOR COMMIT 378258006c924e258f2433a94c1d9d7cb462e128 ***

commit 378258006c924e258f2433a94c1d9d7cb462e128
Author:     Andrew Burgess <[hidden email]>
AuthorDate: Tue Jun 23 10:02:47 2020 +0100
Commit:     Andrew Burgess <[hidden email]>
CommitDate: Tue Jun 23 10:06:20 2020 +0100

    gdb: Add --with-python-libdir to gdb's --configuration output
   
    Commit:
   
      commit d13c7322fe1266984024644154003a19664610ea
      Date:   Fri Jan 17 00:10:22 2020 +0000
   
          gdb: Allow more control over where to find python libraries
   
    Added a new configuration option --with-python-libdir, but failed to
    add this option to the output of 'gdb --configuration'.  This commit
    fixes this mistake.
   
    gdb/ChangeLog:
   
            * top.c (print_gdb_configuration): Print --with-python-libdir
            configuration value.

diff --git a/gdb/ChangeLog b/gdb/ChangeLog
index a83f5afdcd..cf1c037cc7 100644
--- a/gdb/ChangeLog
+++ b/gdb/ChangeLog
@@ -1,3 +1,8 @@
+2020-06-23  Andrew Burgess  <[hidden email]>
+
+ * top.c (print_gdb_configuration): Print --with-python-libdir
+ configuration value.
+
 2020-06-22  Philippe Waroquiers  <[hidden email]>
 
  * NEWS: Mention change to the alias command.
diff --git a/gdb/top.c b/gdb/top.c
index da9b805b47..acd31afb9a 100644
--- a/gdb/top.c
+++ b/gdb/top.c
@@ -1567,6 +1567,15 @@ This GDB was configured as follows:\n\
              --without-python\n\
 "));
 #endif
+#ifdef WITH_PYTHON_LIBDIR
+  fprintf_filtered (stream, _("\
+             --with-python-libdir=%s%s\n\
+"), WITH_PYTHON_LIBDIR, PYTHON_LIBDIR_RELOCATABLE ? " (relocatable)" : "");
+#else
+  fprintf_filtered (stream, _("\
+             --without-python-libdir\n\
+"));
+#endif
 
 #if HAVE_LIBDEBUGINFOD
   fprintf_filtered (stream, _("\
Reply | Threaded
Open this post in threaded view
|

Failures on Ubuntu-Aarch64-native-extended-gdbserver-m64, branch master

Sourceware - gdb-testers mailing list
Buildername:
        Ubuntu-Aarch64-native-extended-gdbserver-m64

Worker:
        ubuntu-aarch64

Full Build URL:
        https://gdb-buildbot.osci.io/#builders/5/builds/3135

Author:
        Andrew Burgess <[hidden email]>

Commit tested:
        378258006c924e258f2433a94c1d9d7cb462e128

Subject of commit:
        gdb: Add --with-python-libdir to gdb's --configuration output

Testsuite logs (gdb.sum, gdb.log and others):
        https://gdb-buildbot.osci.io/results/Ubuntu-Aarch64-native-extended-gdbserver-m64/37/378258006c924e258f2433a94c1d9d7cb462e128/

*** Diff to previous build ***
==============================================
PASS -> FAIL: gdb.threads/linux-dp.exp: philosopher is distinct: 2
==============================================

*** Complete list of XFAILs for this builder ***

To obtain the list of XFAIL tests for this builder, go to:

        <https://gdb-buildbot.osci.io/results/Ubuntu-Aarch64-native-extended-gdbserver-m64/37/378258006c924e258f2433a94c1d9d7cb462e128//xfail.gz>

You can also see a pretty-printed version of the list, with more information
about each XFAIL, by going to:

        <https://gdb-buildbot.osci.io/results/Ubuntu-Aarch64-native-extended-gdbserver-m64/37/378258006c924e258f2433a94c1d9d7cb462e128//xfail.table.gz>

Reply | Threaded
Open this post in threaded view
|

Failures on Ubuntu-Aarch64-native-gdbserver-m64, branch master

Sourceware - gdb-testers mailing list
In reply to this post by Sourceware - gdb-testers mailing list
Buildername:
        Ubuntu-Aarch64-native-gdbserver-m64

Worker:
        ubuntu-aarch64

Full Build URL:
        https://gdb-buildbot.osci.io/#builders/19/builds/3176

Author:
        Andrew Burgess <[hidden email]>

Commit tested:
        378258006c924e258f2433a94c1d9d7cb462e128

Subject of commit:
        gdb: Add --with-python-libdir to gdb's --configuration output

Testsuite logs (gdb.sum, gdb.log and others):
        https://gdb-buildbot.osci.io/results/Ubuntu-Aarch64-native-gdbserver-m64/37/378258006c924e258f2433a94c1d9d7cb462e128/

*** Diff to previous build ***
==============================================
PASS -> KFAIL: gdb.threads/process-dies-while-handling-bp.exp: non_stop=off: cond_bp_target=0: inferior 1 exited
==============================================

*** Complete list of XFAILs for this builder ***

To obtain the list of XFAIL tests for this builder, go to:

        <https://gdb-buildbot.osci.io/results/Ubuntu-Aarch64-native-gdbserver-m64/37/378258006c924e258f2433a94c1d9d7cb462e128//xfail.gz>

You can also see a pretty-printed version of the list, with more information
about each XFAIL, by going to:

        <https://gdb-buildbot.osci.io/results/Ubuntu-Aarch64-native-gdbserver-m64/37/378258006c924e258f2433a94c1d9d7cb462e128//xfail.table.gz>

Reply | Threaded
Open this post in threaded view
|

*** COMPILATION FAILED *** Failures on Fedora-i686, branch master *** BREAKAGE ***

gdb-buildbot-2
In reply to this post by Sourceware - gdb-testers mailing list
Buildername:
        Fedora-i686

Worker:
        fedora-x86-64-4

Full Build URL:
        https://gdb-buildbot.osci.io/#builders/18/builds/3540

Author:
        Andrew Burgess <[hidden email]>

Commit tested:
        378258006c924e258f2433a94c1d9d7cb462e128

Subject of commit:
        gdb: Add --with-python-libdir to gdb's --configuration output

*** FAILED to build GDB -- compile gdb ***
==============================================

+++ The full log is too big to be posted here.
+++ These are the last 100 lines of it.

  CXX    user-regs.o
  CXX    utils.o
  CXX    v850-tdep.o
  CXX    valarith.o
  CXX    valops.o
  CXX    valprint.o
  CXX    value.o
  CXX    varobj.o
  CXX    vax-nbsd-tdep.o
  CXX    vax-tdep.o
  GEN    stamp-version
  CXX    windows-tdep.o
  CXX    x86-linux-nat.o
  CXX    x86-nat.o
  CXX    x86-tdep.o
  CXX    xcoffread.o
  GEN    xml-builtin.c
  CXX    xml-support.o
  CXX    xml-syscall.o
  CXX    xml-tdesc.o
  CXX    xstormy16-tdep.o
  CXX    xtensa-config.o
  CXX    xtensa-linux-tdep.o
  CXX    xtensa-tdep.o
  CXX    gdb.o
  CXX    aarch32-tdep.o
  CXX    ada-exp.o
  CXX    ada-lang.o
  CXX    ada-tasks.o
  CXX    ada-typeprint.o
  CXX    ada-valprint.o
  CXX    ada-varobj.o
  CXX    addrmap.o
  CXX    agent.o
  CXX    alloc.o
  CXX    annotate.o
  CXX    arc-tdep.o
  CXX    arch-utils.o
  CXX    arch/aarch32.o
  CXX    arch/arc.o
  CXX    arch/arm-get-next-pcs.o
  CXX    arch/arm-linux.o
  CXX    arch/arm.o
  CXX    arch/i386.o
  CXX    arch/ppc-linux-common.o
  CXX    arch/riscv.o
  CXX    arm-bsd-tdep.o
  CXX    arm-fbsd-tdep.o
  CXX    arm-linux-tdep.o
  CXX    arm-nbsd-tdep.o
  CXX    arm-obsd-tdep.o
  CXX    arm-pikeos-tdep.o
  CXX    arm-symbian-tdep.o
  CXX    arm-tdep.o
  CXX    arm-wince-tdep.o
  CXX    async-event.o
  CXX    auto-load.o
  CXX    auxv.o
  CXX    avr-tdep.o
  CXX    ax-gdb.o
  CXX    ax-general.o
  CXX    bcache.o
  CXX    bfd-target.o
  CXX    bfin-linux-tdep.o
  CXX    bfin-tdep.o
  CXX    block.o
  CXX    blockframe.o
  CXX    break-catch-sig.o
  CXX    break-catch-syscall.o
  CXX    break-catch-throw.o
  CXX    breakpoint.o
  CXX    bsd-uthread.o
  CXX    btrace.o
  CXX    build-id.o
  CXX    buildsym-legacy.o
  CXX    buildsym.o
  CXX    c-exp.o
  CXX    cp-name-parser.o
  CXX    d-exp.o
  CXX    f-exp.o
  CXX    go-exp.o
  CXX    m2-exp.o
  CXX    p-exp.o
  CXX    rust-exp.o
  CXX    version.o
  CXX    xml-builtin.o
  GEN    init.c
  CXX    init.o
  CXXLD  gdb
/usr/bin/ld: ../opcodes/libopcodes.a(riscv-dis.o): in function `parse_riscv_dis_option':
/home/gdb-buildbot-2/fedora-x86-64-4/fedora-i686/build/opcodes/../../binutils-gdb/opcodes/riscv-dis.c:102: undefined reference to `riscv_get_priv_spec_class'
collect2: error: ld returned 1 exit status
make[2]: *** [Makefile:1861: gdb] Error 1
make[2]: Leaving directory '/home/gdb-buildbot-2/fedora-x86-64-4/fedora-i686/build/gdb'
make[1]: *** [Makefile:10066: all-gdb] Error 2
make[1]: Leaving directory '/home/gdb-buildbot-2/fedora-x86-64-4/fedora-i686/build'
make: *** [Makefile:854: all] Error 2
program finished with exit code 2
elapsedTime=477.113740
==============================================

Reply | Threaded
Open this post in threaded view
|

Failures on Fedora-x86_64-m32, branch master

gdb-buildbot-2
In reply to this post by Sourceware - gdb-testers mailing list
Buildername:
        Fedora-x86_64-m32

Worker:
        fedora-x86-64-3

Full Build URL:
        https://gdb-buildbot.osci.io/#builders/17/builds/3534

Author:
        Andrew Burgess <[hidden email]>

Commit tested:
        378258006c924e258f2433a94c1d9d7cb462e128

Subject of commit:
        gdb: Add --with-python-libdir to gdb's --configuration output

Testsuite logs (gdb.sum, gdb.log and others):
        https://gdb-buildbot.osci.io/results/Fedora-x86_64-m32/37/378258006c924e258f2433a94c1d9d7cb462e128/

*** Diff to previous build ***
==============================================
new FAIL: gdb.base/coredump-filter.exp: disassembling function main for non-Private-Anonymous: no binary: loading /home/gdb-buildbot/fedora-x86-64-3/fedora-x86-64-m32/build/gdb/testsuite/outputs/gdb.base/coredump-filter/non-private-anon.gcore
new FAIL: gdb.base/coredump-filter.exp: loading and testing corefile for non-Shared-Anonymous: loading /home/gdb-buildbot/fedora-x86-64-3/fedora-x86-64-m32/build/gdb/testsuite/outputs/gdb.base/coredump-filter/non-shared-anon.gcore
==============================================

*** Complete list of XFAILs for this builder ***

To obtain the list of XFAIL tests for this builder, go to:

        <https://gdb-buildbot.osci.io/results/Fedora-x86_64-m32/37/378258006c924e258f2433a94c1d9d7cb462e128//xfail.gz>

You can also see a pretty-printed version of the list, with more information
about each XFAIL, by going to:

        <https://gdb-buildbot.osci.io/results/Fedora-x86_64-m32/37/378258006c924e258f2433a94c1d9d7cb462e128//xfail.table.gz>

Reply | Threaded
Open this post in threaded view
|

Failures on Fedora-x86_64-cc-with-index, branch master

gdb-buildbot-2
In reply to this post by Sourceware - gdb-testers mailing list
Buildername:
        Fedora-x86_64-cc-with-index

Worker:
        fedora-x86-64-4

Full Build URL:
        https://gdb-buildbot.osci.io/#builders/20/builds/3488

Author:
        Andrew Burgess <[hidden email]>

Commit tested:
        378258006c924e258f2433a94c1d9d7cb462e128

Subject of commit:
        gdb: Add --with-python-libdir to gdb's --configuration output

Testsuite logs (gdb.sum, gdb.log and others):
        https://gdb-buildbot.osci.io/results/Fedora-x86_64-cc-with-index/37/378258006c924e258f2433a94c1d9d7cb462e128/

*** Diff to previous build ***
==============================================
PASS -> KFAIL: gdb.threads/omp-par-scope.exp: multi_scope: first thread: print i02
PASS -> KFAIL: gdb.threads/omp-par-scope.exp: multi_scope: first thread: print i12
PASS -> KFAIL: gdb.threads/omp-par-scope.exp: multi_scope: first thread: print i22
PASS -> KFAIL: gdb.threads/omp-par-scope.exp: nested_parallel: inner_threads: 2nd stop: print i
PASS -> KFAIL: gdb.threads/omp-par-scope.exp: nested_parallel: inner_threads: 2nd stop: print j
==============================================

*** Complete list of XFAILs for this builder ***

To obtain the list of XFAIL tests for this builder, go to:

        <https://gdb-buildbot.osci.io/results/Fedora-x86_64-cc-with-index/37/378258006c924e258f2433a94c1d9d7cb462e128//xfail.gz>

You can also see a pretty-printed version of the list, with more information
about each XFAIL, by going to:

        <https://gdb-buildbot.osci.io/results/Fedora-x86_64-cc-with-index/37/378258006c924e258f2433a94c1d9d7cb462e128//xfail.table.gz>

Reply | Threaded
Open this post in threaded view
|

Failures on Fedora-x86_64-m64, branch master

gdb-buildbot-2
In reply to this post by Sourceware - gdb-testers mailing list
Buildername:
        Fedora-x86_64-m64

Worker:
        fedora-x86-64-3

Full Build URL:
        https://gdb-buildbot.osci.io/#builders/3/builds/3597

Author:
        Andrew Burgess <[hidden email]>

Commit tested:
        378258006c924e258f2433a94c1d9d7cb462e128

Subject of commit:
        gdb: Add --with-python-libdir to gdb's --configuration output

Testsuite logs (gdb.sum, gdb.log and others):
        https://gdb-buildbot.osci.io/results/Fedora-x86_64-m64/37/378258006c924e258f2433a94c1d9d7cb462e128/

*** Diff to previous build ***
==============================================
PASS -> KFAIL: gdb.threads/omp-par-scope.exp: nested_func: 1st call: 2nd thread: print k
PASS -> KFAIL: gdb.threads/omp-par-scope.exp: nested_func: 1st call: 2nd thread: print r
PASS -> KFAIL: gdb.threads/omp-par-scope.exp: nested_func: 1st call: 2nd thread: print z
PASS -> KFAIL: gdb.threads/omp-par-scope.exp: nested_func: 2nd call: 2nd thread: print k
PASS -> KFAIL: gdb.threads/omp-par-scope.exp: nested_func: 2nd call: 2nd thread: print r
PASS -> KFAIL: gdb.threads/omp-par-scope.exp: nested_func: 2nd call: 2nd thread: print z
PASS -> KFAIL: gdb.threads/process-dies-while-handling-bp.exp: non_stop=on: cond_bp_target=0: inferior 1 exited
==============================================

*** Complete list of XFAILs for this builder ***

To obtain the list of XFAIL tests for this builder, go to:

        <https://gdb-buildbot.osci.io/results/Fedora-x86_64-m64/37/378258006c924e258f2433a94c1d9d7cb462e128//xfail.gz>

You can also see a pretty-printed version of the list, with more information
about each XFAIL, by going to:

        <https://gdb-buildbot.osci.io/results/Fedora-x86_64-m64/37/378258006c924e258f2433a94c1d9d7cb462e128//xfail.table.gz>

Reply | Threaded
Open this post in threaded view
|

Failures on Fedora-x86_64-native-extended-gdbserver-m32, branch master

gdb-buildbot-2
In reply to this post by Sourceware - gdb-testers mailing list
Buildername:
        Fedora-x86_64-native-extended-gdbserver-m32

Worker:
        fedora-x86-64-4

Full Build URL:
        https://gdb-buildbot.osci.io/#builders/4/builds/3430

Author:
        Andrew Burgess <[hidden email]>

Commit tested:
        378258006c924e258f2433a94c1d9d7cb462e128

Subject of commit:
        gdb: Add --with-python-libdir to gdb's --configuration output

Testsuite logs (gdb.sum, gdb.log and others):
        https://gdb-buildbot.osci.io/results/Fedora-x86_64-native-extended-gdbserver-m32/37/378258006c924e258f2433a94c1d9d7cb462e128/

*** Diff to previous build ***
==============================================
PASS -> FAIL: gdb.multi/multi-re-run.exp: re_run_inf=1: iter=1: continue until exit
PASS -> FAIL: gdb.multi/multi-re-run.exp: re_run_inf=1: iter=1: print re_run_var_1
new UNRESOLVED: gdb.multi/multi-re-run.exp: re_run_inf=1: iter=2: delete all breakpoints in delete_breakpoints
PASS -> UNRESOLVED: gdb.multi/multi-re-run.exp: re_run_inf=1: iter=2: setting breakpoint at all_started
PASS -> UNRESOLVED: gdb.threads/attach-into-signal.exp: threaded: attach
new FAIL: gdb.threads/attach-into-signal.exp: threaded: thread apply 2 print $_siginfo.si_signo
PASS -> FAIL: gdb.threads/attach-many-short-lived-threads.exp: iter 10: break at break_fn: 1
PASS -> FAIL: gdb.threads/attach-many-short-lived-threads.exp: iter 10: break at break_fn: 2
PASS -> FAIL: gdb.threads/attach-many-short-lived-threads.exp: iter 10: break at break_fn: 3
PASS -> FAIL: gdb.threads/attach-many-short-lived-threads.exp: iter 2: break at break_fn: 1
PASS -> FAIL: gdb.threads/attach-many-short-lived-threads.exp: iter 2: break at break_fn: 2
PASS -> FAIL: gdb.threads/attach-many-short-lived-threads.exp: iter 2: break at break_fn: 3
PASS -> FAIL: gdb.threads/attach-many-short-lived-threads.exp: iter 2: detach
PASS -> FAIL: gdb.threads/attach-many-short-lived-threads.exp: iter 2: reset timer in the inferior
PASS -> FAIL: gdb.threads/attach-many-short-lived-threads.exp: iter 3: break at break_fn: 1
PASS -> FAIL: gdb.threads/attach-many-short-lived-threads.exp: iter 3: break at break_fn: 2
PASS -> FAIL: gdb.threads/attach-many-short-lived-threads.exp: iter 3: break at break_fn: 3
PASS -> FAIL: gdb.threads/attach-many-short-lived-threads.exp: iter 3: detach
PASS -> FAIL: gdb.threads/attach-many-short-lived-threads.exp: iter 3: reset timer in the inferior
PASS -> FAIL: gdb.threads/attach-many-short-lived-threads.exp: iter 4: break at break_fn: 1
PASS -> FAIL: gdb.threads/attach-many-short-lived-threads.exp: iter 4: break at break_fn: 2
PASS -> FAIL: gdb.threads/attach-many-short-lived-threads.exp: iter 4: break at break_fn: 3
PASS -> FAIL: gdb.threads/attach-many-short-lived-threads.exp: iter 4: detach
PASS -> FAIL: gdb.threads/attach-many-short-lived-threads.exp: iter 4: reset timer in the inferior
PASS -> FAIL: gdb.threads/attach-many-short-lived-threads.exp: iter 5: break at break_fn: 1
PASS -> FAIL: gdb.threads/attach-many-short-lived-threads.exp: iter 5: break at break_fn: 2
PASS -> FAIL: gdb.threads/attach-many-short-lived-threads.exp: iter 5: break at break_fn: 3
PASS -> FAIL: gdb.threads/attach-many-short-lived-threads.exp: iter 5: detach
PASS -> FAIL: gdb.threads/attach-many-short-lived-threads.exp: iter 5: reset timer in the inferior
PASS -> FAIL: gdb.threads/attach-many-short-lived-threads.exp: iter 6: break at break_fn: 1
PASS -> FAIL: gdb.threads/attach-many-short-lived-threads.exp: iter 6: break at break_fn: 2
PASS -> FAIL: gdb.threads/attach-many-short-lived-threads.exp: iter 6: break at break_fn: 3
PASS -> FAIL: gdb.threads/attach-many-short-lived-threads.exp: iter 6: detach
PASS -> FAIL: gdb.threads/attach-many-short-lived-threads.exp: iter 6: reset timer in the inferior
PASS -> FAIL: gdb.threads/attach-many-short-lived-threads.exp: iter 7: break at break_fn: 1
PASS -> FAIL: gdb.threads/attach-many-short-lived-threads.exp: iter 7: break at break_fn: 2
PASS -> FAIL: gdb.threads/attach-many-short-lived-threads.exp: iter 7: break at break_fn: 3
PASS -> FAIL: gdb.threads/attach-many-short-lived-threads.exp: iter 7: detach
PASS -> FAIL: gdb.threads/attach-many-short-lived-threads.exp: iter 7: reset timer in the inferior
PASS -> FAIL: gdb.threads/attach-many-short-lived-threads.exp: iter 8: break at break_fn: 1
PASS -> FAIL: gdb.threads/attach-many-short-lived-threads.exp: iter 8: break at break_fn: 2
PASS -> FAIL: gdb.threads/attach-many-short-lived-threads.exp: iter 8: break at break_fn: 3
PASS -> FAIL: gdb.threads/attach-many-short-lived-threads.exp: iter 8: detach
PASS -> FAIL: gdb.threads/attach-many-short-lived-threads.exp: iter 8: reset timer in the inferior
PASS -> FAIL: gdb.threads/attach-many-short-lived-threads.exp: iter 9: break at break_fn: 1
PASS -> FAIL: gdb.threads/attach-many-short-lived-threads.exp: iter 9: break at break_fn: 2
PASS -> FAIL: gdb.threads/attach-many-short-lived-threads.exp: iter 9: break at break_fn: 3
PASS -> FAIL: gdb.threads/attach-many-short-lived-threads.exp: iter 9: detach
PASS -> FAIL: gdb.threads/attach-many-short-lived-threads.exp: iter 9: reset timer in the inferior
UNRESOLVED -> FAIL: gdb.threads/fork-plus-threads.exp: detach-on-fork=off: inferior 1 exited
new FAIL: gdb.threads/fork-plus-threads.exp: detach-on-fork=off: only inferior 1 left
PASS -> KFAIL: gdb.threads/process-dies-while-handling-bp.exp: non_stop=off: cond_bp_target=0: inferior 1 exited
new KFAIL: gdb.threads/watchthreads2.exp: gdb can drop watchpoints in multithreaded app
==============================================

*** Complete list of XFAILs for this builder ***

To obtain the list of XFAIL tests for this builder, go to:

        <https://gdb-buildbot.osci.io/results/Fedora-x86_64-native-extended-gdbserver-m32/37/378258006c924e258f2433a94c1d9d7cb462e128//xfail.gz>

You can also see a pretty-printed version of the list, with more information
about each XFAIL, by going to:

        <https://gdb-buildbot.osci.io/results/Fedora-x86_64-native-extended-gdbserver-m32/37/378258006c924e258f2433a94c1d9d7cb462e128//xfail.table.gz>

Reply | Threaded
Open this post in threaded view
|

Failures on Fedora-x86_64-native-extended-gdbserver-m64, branch master

gdb-buildbot-2
In reply to this post by Sourceware - gdb-testers mailing list
Buildername:
        Fedora-x86_64-native-extended-gdbserver-m64

Worker:
        fedora-x86-64-3

Full Build URL:
        https://gdb-buildbot.osci.io/#builders/2/builds/3431

Author:
        Andrew Burgess <[hidden email]>

Commit tested:
        378258006c924e258f2433a94c1d9d7cb462e128

Subject of commit:
        gdb: Add --with-python-libdir to gdb's --configuration output

Testsuite logs (gdb.sum, gdb.log and others):
        https://gdb-buildbot.osci.io/results/Fedora-x86_64-native-extended-gdbserver-m64/37/378258006c924e258f2433a94c1d9d7cb462e128/

*** Diff to previous build ***
==============================================
PASS -> FAIL: gdb.multi/multi-re-run.exp: re_run_inf=2: iter=1: continue until exit
PASS -> FAIL: gdb.multi/multi-re-run.exp: re_run_inf=2: iter=1: print re_run_var_2
new UNRESOLVED: gdb.multi/multi-re-run.exp: re_run_inf=2: iter=2: delete all breakpoints in delete_breakpoints
PASS -> UNRESOLVED: gdb.multi/multi-re-run.exp: re_run_inf=2: iter=2: setting breakpoint at all_started
PASS -> UNRESOLVED: gdb.threads/attach-into-signal.exp: threaded: attach
new FAIL: gdb.threads/attach-into-signal.exp: threaded: thread apply 2 print $_siginfo.si_signo
PASS -> FAIL: gdb.threads/fork-plus-threads.exp: detach-on-fork=off: inferior 1 exited
PASS -> FAIL: gdb.threads/fork-plus-threads.exp: detach-on-fork=off: only inferior 1 left
PASS -> FAIL: gdb.threads/interrupted-hand-call.exp: continue until exit
PASS -> KFAIL: gdb.threads/omp-par-scope.exp: nested_func: 2nd call: 1st thread: print k
PASS -> KFAIL: gdb.threads/omp-par-scope.exp: nested_func: 2nd call: 1st thread: print r
PASS -> KFAIL: gdb.threads/omp-par-scope.exp: nested_func: 2nd call: 1st thread: print z
PASS -> KFAIL: gdb.threads/omp-par-scope.exp: nested_parallel: inner_threads: 2nd stop: print i
PASS -> KFAIL: gdb.threads/omp-par-scope.exp: nested_parallel: inner_threads: 2nd stop: print j
PASS -> KFAIL: gdb.threads/process-dies-while-handling-bp.exp: non_stop=off: cond_bp_target=0: inferior 1 exited
==============================================

*** Complete list of XFAILs for this builder ***

To obtain the list of XFAIL tests for this builder, go to:

        <https://gdb-buildbot.osci.io/results/Fedora-x86_64-native-extended-gdbserver-m64/37/378258006c924e258f2433a94c1d9d7cb462e128//xfail.gz>

You can also see a pretty-printed version of the list, with more information
about each XFAIL, by going to:

        <https://gdb-buildbot.osci.io/results/Fedora-x86_64-native-extended-gdbserver-m64/37/378258006c924e258f2433a94c1d9d7cb462e128//xfail.table.gz>

Reply | Threaded
Open this post in threaded view
|

Failures on Fedora-x86_64-native-gdbserver-m32, branch master

gdb-buildbot-2
In reply to this post by Sourceware - gdb-testers mailing list
Buildername:
        Fedora-x86_64-native-gdbserver-m32

Worker:
        fedora-x86-64-4

Full Build URL:
        https://gdb-buildbot.osci.io/#builders/24/builds/3443

Author:
        Andrew Burgess <[hidden email]>

Commit tested:
        378258006c924e258f2433a94c1d9d7cb462e128

Subject of commit:
        gdb: Add --with-python-libdir to gdb's --configuration output

Testsuite logs (gdb.sum, gdb.log and others):
        https://gdb-buildbot.osci.io/results/Fedora-x86_64-native-gdbserver-m32/37/378258006c924e258f2433a94c1d9d7cb462e128/

*** Diff to previous build ***
==============================================
PASS -> KFAIL: gdb.threads/process-dies-while-handling-bp.exp: non_stop=off: cond_bp_target=0: inferior 1 exited
==============================================

*** Complete list of XFAILs for this builder ***

To obtain the list of XFAIL tests for this builder, go to:

        <https://gdb-buildbot.osci.io/results/Fedora-x86_64-native-gdbserver-m32/37/378258006c924e258f2433a94c1d9d7cb462e128//xfail.gz>

You can also see a pretty-printed version of the list, with more information
about each XFAIL, by going to:

        <https://gdb-buildbot.osci.io/results/Fedora-x86_64-native-gdbserver-m32/37/378258006c924e258f2433a94c1d9d7cb462e128//xfail.table.gz>

Reply | Threaded
Open this post in threaded view
|

Failures on Fedora-x86_64-native-gdbserver-m64, branch master

gdb-buildbot-2
In reply to this post by Sourceware - gdb-testers mailing list
Buildername:
        Fedora-x86_64-native-gdbserver-m64

Worker:
        fedora-x86-64-3

Full Build URL:
        https://gdb-buildbot.osci.io/#builders/22/builds/3442

Author:
        Andrew Burgess <[hidden email]>

Commit tested:
        378258006c924e258f2433a94c1d9d7cb462e128

Subject of commit:
        gdb: Add --with-python-libdir to gdb's --configuration output

Testsuite logs (gdb.sum, gdb.log and others):
        https://gdb-buildbot.osci.io/results/Fedora-x86_64-native-gdbserver-m64/37/378258006c924e258f2433a94c1d9d7cb462e128/

*** Diff to previous build ***
==============================================
PASS -> FAIL: gdb.threads/interrupted-hand-call.exp: continue until exit
PASS -> KFAIL: gdb.threads/omp-par-scope.exp: multi_scope: first thread: print i02
PASS -> KFAIL: gdb.threads/omp-par-scope.exp: multi_scope: first thread: print i12
PASS -> KFAIL: gdb.threads/omp-par-scope.exp: multi_scope: first thread: print i22
PASS -> KFAIL: gdb.threads/omp-par-scope.exp: nested_func: 2nd call: 2nd thread: print k
PASS -> KFAIL: gdb.threads/omp-par-scope.exp: nested_func: 2nd call: 2nd thread: print r
PASS -> KFAIL: gdb.threads/omp-par-scope.exp: nested_func: 2nd call: 2nd thread: print z
PASS -> FAIL: gdb.threads/thread-unwindonsignal.exp: continue until exit
==============================================

*** Complete list of XFAILs for this builder ***

To obtain the list of XFAIL tests for this builder, go to:

        <https://gdb-buildbot.osci.io/results/Fedora-x86_64-native-gdbserver-m64/37/378258006c924e258f2433a94c1d9d7cb462e128//xfail.gz>

You can also see a pretty-printed version of the list, with more information
about each XFAIL, by going to:

        <https://gdb-buildbot.osci.io/results/Fedora-x86_64-native-gdbserver-m64/37/378258006c924e258f2433a94c1d9d7cb462e128//xfail.table.gz>