[binutils-gdb] Fix gdb.base/remote.exp with native-extended-gdbserver board

classic Classic list List threaded Threaded
12 messages Options
Reply | Threaded
Open this post in threaded view
|

[binutils-gdb] Fix gdb.base/remote.exp with native-extended-gdbserver board

sergiodj+buildbot-2
*** TEST RESULTS FOR COMMIT 035522c0228be33b2124ada2f178187e7e53aa6c ***

Author: Pedro Alves <[hidden email]>
Branch: master
Commit: 035522c0228be33b2124ada2f178187e7e53aa6c

Fix gdb.base/remote.exp with native-extended-gdbserver board

This fixes gdb.base/remote.exp regressions caused by the previous
commit to the testcase, when tested with
--target_board=native-extended-gdbserver.  For example:

  ...
  show remote memory-write-packet-size
  The memory-write-packet-size is 0 (default). Packets are limited to 16383 bytes.
  (gdb) FAIL: gdb.base/remote.exp: write-packet default
  ...

With that board, GDB connects to GDBserver at gdb_start time, so GDB
is showing the actual remote/gdbserver packet size limits.

Fix it using the usual "disconnect" pattern.  While at it, there's no
need to start GDB before compiling the testcase.

gdb/testsuite/ChangeLog:
2018-05-22  Pedro Alves  <[hidden email]>

        * gdb.base/remote.exp: Only gdb_start after compiling the
        testcase.  Issue "disconnect" before testing "set remote" command
        defaults.  Issue clean_restart before running to main.
Reply | Threaded
Open this post in threaded view
|

Failures on Fedora-s390x-m64, branch master

sergiodj+buildbot-2
Buildslave:
        marist-fedora-s390x

Full Build URL:
        <http://gdb-build.sergiodj.net/builders/Fedora-s390x-m64/builds/8599>

Commit(s) tested:
        035522c0228be33b2124ada2f178187e7e53aa6c

Author(s) (in the same order as the commits):
        Pedro Alves <[hidden email]>

Subject:
        Fix gdb.base/remote.exp with native-extended-gdbserver board

Testsuite log (gdb.sum and gdb.log) URL(s):
        <http://gdb-build.sergiodj.net/results/Fedora-s390x-m64/03/035522c0228be33b2124ada2f178187e7e53aa6c/>

*** Diff to previous build ***
============================
PASS -> KFAIL: gdb.threads/multiple-successive-infcall.exp: thread=4: testing if call get_value
PASS -> KFAIL: gdb.threads/process-dies-while-handling-bp.exp: non_stop=off: cond_bp_target=0: inferior 1 exited
============================


*** Complete list of XFAILs for this builder ***

To obtain the list of XFAIL tests for this builder, go to:

        <https://git.sergiodj.net/gdb-xfails.git/tree/xfails/Fedora-s390x-m64/xfails/master/xfail?id=b916c04>

You can also see a pretty-printed version of the list, with more information
about each XFAIL, by going to:

        <https://git.sergiodj.net/gdb-xfails.git/tree/xfails/Fedora-s390x-m64/xfails/master/xfail.table?id=b916c04>



Reply | Threaded
Open this post in threaded view
|

Failures on RHEL-s390x-m64, branch master

sergiodj+buildbot-2
In reply to this post by sergiodj+buildbot-2
Buildslave:
        rhel-7_1-s390x-1

Full Build URL:
        <http://gdb-build.sergiodj.net/builders/RHEL-s390x-m64/builds/7275>

Commit(s) tested:
        035522c0228be33b2124ada2f178187e7e53aa6c

Author(s) (in the same order as the commits):
        Pedro Alves <[hidden email]>

Subject:
        Fix gdb.base/remote.exp with native-extended-gdbserver board

Testsuite log (gdb.sum and gdb.log) URL(s):
        <http://gdb-build.sergiodj.net/results/RHEL-s390x-m64/03/035522c0228be33b2124ada2f178187e7e53aa6c/>

*** Diff to previous build ***
============================
PASS -> KFAIL: gdb.threads/process-dies-while-handling-bp.exp: non_stop=off: cond_bp_target=0: inferior 1 exited
============================


*** Complete list of XFAILs for this builder ***

To obtain the list of XFAIL tests for this builder, go to:

        <https://git.sergiodj.net/gdb-xfails.git/tree/xfails/RHEL-s390x-m64/xfails/master/xfail?id=6da72a5>

You can also see a pretty-printed version of the list, with more information
about each XFAIL, by going to:

        <https://git.sergiodj.net/gdb-xfails.git/tree/xfails/RHEL-s390x-m64/xfails/master/xfail.table?id=6da72a5>



Reply | Threaded
Open this post in threaded view
|

Failures on Debian-s390x-m64, branch master

sergiodj+buildbot-2
In reply to this post by sergiodj+buildbot-2
Buildslave:
        debian-jessie-s390x-1

Full Build URL:
        <http://gdb-build.sergiodj.net/builders/Debian-s390x-m64/builds/5403>

Commit(s) tested:
        035522c0228be33b2124ada2f178187e7e53aa6c

Author(s) (in the same order as the commits):
        Pedro Alves <[hidden email]>

Subject:
        Fix gdb.base/remote.exp with native-extended-gdbserver board

Testsuite log (gdb.sum and gdb.log) URL(s):
        <http://gdb-build.sergiodj.net/results/Debian-s390x-m64/03/035522c0228be33b2124ada2f178187e7e53aa6c/>

*** Diff to previous build ***
============================
PASS -> KFAIL: gdb.threads/process-dies-while-handling-bp.exp: non_stop=on: cond_bp_target=1: inferior 1 exited
PASS -> KFAIL: gdb.threads/process-dies-while-handling-bp.exp: non_stop=off: cond_bp_target=1: inferior 1 exited
PASS -> KFAIL: gdb.threads/process-dies-while-handling-bp.exp: non_stop=off: cond_bp_target=0: inferior 1 exited
============================


*** Complete list of XFAILs for this builder ***

To obtain the list of XFAIL tests for this builder, go to:

        <https://git.sergiodj.net/gdb-xfails.git/tree/xfails/Debian-s390x-m64/xfails/master/xfail?id=6c960dc>

You can also see a pretty-printed version of the list, with more information
about each XFAIL, by going to:

        <https://git.sergiodj.net/gdb-xfails.git/tree/xfails/Debian-s390x-m64/xfails/master/xfail.table?id=6c960dc>



Reply | Threaded
Open this post in threaded view
|

Failures on Debian-s390x-native-extended-gdbserver-m64, branch master

sergiodj+buildbot-2
In reply to this post by sergiodj+buildbot-2
Buildslave:
        debian-jessie-s390x-1

Full Build URL:
        <http://gdb-build.sergiodj.net/builders/Debian-s390x-native-extended-gdbserver-m64/builds/5597>

Commit(s) tested:
        035522c0228be33b2124ada2f178187e7e53aa6c

Author(s) (in the same order as the commits):
        Pedro Alves <[hidden email]>

Subject:
        Fix gdb.base/remote.exp with native-extended-gdbserver board

Testsuite log (gdb.sum and gdb.log) URL(s):
        <http://gdb-build.sergiodj.net/results/Debian-s390x-native-extended-gdbserver-m64/03/035522c0228be33b2124ada2f178187e7e53aa6c/>

*** Diff to previous build ***
============================
PASS -> KFAIL: gdb.threads/process-dies-while-handling-bp.exp: non_stop=on: cond_bp_target=1: inferior 1 exited
============================


*** Complete list of XFAILs for this builder ***

To obtain the list of XFAIL tests for this builder, go to:

        <https://git.sergiodj.net/gdb-xfails.git/tree/xfails/Debian-s390x-native-extended-gdbserver-m64/xfails/master/xfail?id=203280d>

You can also see a pretty-printed version of the list, with more information
about each XFAIL, by going to:

        <https://git.sergiodj.net/gdb-xfails.git/tree/xfails/Debian-s390x-native-extended-gdbserver-m64/xfails/master/xfail.table?id=203280d>



Reply | Threaded
Open this post in threaded view
|

Failures on Debian-s390x-native-gdbserver-m64, branch master

sergiodj+buildbot-2
In reply to this post by sergiodj+buildbot-2
Buildslave:
        debian-jessie-s390x-1

Full Build URL:
        <http://gdb-build.sergiodj.net/builders/Debian-s390x-native-gdbserver-m64/builds/5451>

Commit(s) tested:
        035522c0228be33b2124ada2f178187e7e53aa6c

Author(s) (in the same order as the commits):
        Pedro Alves <[hidden email]>

Subject:
        Fix gdb.base/remote.exp with native-extended-gdbserver board

Testsuite log (gdb.sum and gdb.log) URL(s):
        <http://gdb-build.sergiodj.net/results/Debian-s390x-native-gdbserver-m64/03/035522c0228be33b2124ada2f178187e7e53aa6c/>

*** Diff to previous build ***
============================
PASS -> KFAIL: gdb.threads/process-dies-while-handling-bp.exp: non_stop=off: cond_bp_target=0: inferior 1 exited
============================


*** Complete list of XFAILs for this builder ***

To obtain the list of XFAIL tests for this builder, go to:

        <https://git.sergiodj.net/gdb-xfails.git/tree/xfails/Debian-s390x-native-gdbserver-m64/xfails/master/xfail?id=91933c9>

You can also see a pretty-printed version of the list, with more information
about each XFAIL, by going to:

        <https://git.sergiodj.net/gdb-xfails.git/tree/xfails/Debian-s390x-native-gdbserver-m64/xfails/master/xfail.table?id=91933c9>



Reply | Threaded
Open this post in threaded view
|

Failures on Fedora-i686, branch master

sergiodj+buildbot-2
In reply to this post by sergiodj+buildbot-2
Buildslave:
        fedora-x86-64-3

Full Build URL:
        <http://gdb-build.sergiodj.net/builders/Fedora-i686/builds/9817>

Commit(s) tested:
        035522c0228be33b2124ada2f178187e7e53aa6c

Author(s) (in the same order as the commits):
        Pedro Alves <[hidden email]>

Subject:
        Fix gdb.base/remote.exp with native-extended-gdbserver board

Testsuite log (gdb.sum and gdb.log) URL(s):
        <http://gdb-build.sergiodj.net/results/Fedora-i686/03/035522c0228be33b2124ada2f178187e7e53aa6c/>

*** Diff to previous build ***
============================
new FAIL: gdb.base/catch-syscall.exp: multiple targets: insert catch syscall on syscall 1 -- write on i386:x86-64
PASS -> FAIL: gdb.base/gdb-sigterm-2.exp: expect eof
new FAIL: gdb.base/info-os.exp: continue to breakpoint: Set breakpoint here
new FAIL: gdb.base/info-os.exp: get shared memory key
new FAIL: gdb.base/info-os.exp: get shared memory ID
new FAIL: gdb.base/info-os.exp: get semaphore key
new FAIL: gdb.base/info-os.exp: get semaphore ID
new FAIL: gdb.base/info-os.exp: get message queue key
new FAIL: gdb.base/info-os.exp: get message queue ID
new FAIL: gdb.base/info-os.exp: get socket port number
new FAIL: gdb.base/info-os.exp: get process list
PASS -> FAIL: gdb.base/jit-simple.exp: standalone: change addr: second run: recompile
PASS -> FAIL: gdb.base/jit-simple.exp: standalone: same addr: initial run: maint info breakpoints shows jit breakpoint
PASS -> FAIL: gdb.base/jit-simple.exp: standalone: same addr: second run: get address of __jit_debug_descriptor
PASS -> FAIL: gdb.base/jit-simple.exp: standalone: same addr: second run: maint info breakpoints shows jit breakpoint
PASS -> FAIL: gdb.base/jit-simple.exp: shared: change addr: second run: recompile
PASS -> FAIL: gdb.base/jit-simple.exp: shared: same addr: initial run: get address of __jit_debug_descriptor
PASS -> FAIL: gdb.base/jit-simple.exp: shared: same addr: initial run: maint info breakpoints shows jit breakpoint
PASS -> FAIL: gdb.base/jit-simple.exp: shared: same addr: second run: get address of __jit_debug_descriptor
PASS -> FAIL: gdb.base/jit-simple.exp: shared: same addr: second run: maint info breakpoints shows jit breakpoint
PASS -> FAIL: gdb.base/quit-live.exp: appear_how=run: extra_inferior=0: quit_how=sighup: quit with SIGHUP
PASS -> FAIL: gdb.base/quit-live.exp: appear_how=run: extra_inferior=1: quit_how=sigterm: quit with SIGTERM
PASS -> FAIL: gdb.base/quit-live.exp: appear_how=attach: extra_inferior=0: quit_how=sigterm: quit with SIGTERM
PASS -> FAIL: gdb.dwarf2/dw2-opt-structptr.exp: mi: continue to func01
PASS -> FAIL: gdb.dwarf2/dw2-opt-structptr.exp: mi: create varobj for ptr
PASS -> FAIL: gdb.dwarf2/dw2-opt-structptr.exp: mi: get children of var1
PASS -> FAIL: gdb.dwarf2/dw2-opt-structptr.exp: mi: throw error, dereference ptr to access integer member
PASS -> FAIL: gdb.dwarf2/dw2-opt-structptr.exp: mi: throw error, dereference ptr to access array member
PASS -> FAIL: gdb.dwarf2/dw2-opt-structptr.exp: mi: throw error, dereference ptr to access pointer member
PASS -> FAIL: gdb.dwarf2/gdb-index.exp: objcopy
new FAIL: gdb.dwarf2/implref-array.exp: disassemble main
new FAIL: gdb.dwarf2/implref-array.exp: x/2i main+
new FAIL: gdb.dwarf2/implref-const.exp: disassemble main
new FAIL: gdb.dwarf2/implref-const.exp: x/2i main+
new FAIL: gdb.dwarf2/implref-global.exp: disassemble main
new FAIL: gdb.dwarf2/implref-global.exp: x/2i main+
new FAIL: gdb.dwarf2/implref-struct.exp: disassemble main
new FAIL: gdb.dwarf2/implref-struct.exp: x/2i main+
new FAIL: gdb.python/py-finish-breakpoint2.exp: set FinishBP after the exception
new FAIL: gdb.python/py-finish-breakpoint2.exp: check FinishBreakpoint in catch
new FAIL: gdb.python/py-finish-breakpoint2.exp: check finish BP removal
new FAIL: gdb.python/py-finish-breakpoint2.exp: continue to second exception
new FAIL: gdb.server/ext-wrapper.exp: print d
new FAIL: gdb.server/ext-wrapper.exp: restart: print d
new FAIL: gdb.server/ext-wrapper.exp: monitor exit
============================


*** Complete list of XFAILs for this builder ***

To obtain the list of XFAIL tests for this builder, go to:

        <https://git.sergiodj.net/gdb-xfails.git/tree/xfails/Fedora-i686/xfails/master/xfail?id=b24bdf1>

You can also see a pretty-printed version of the list, with more information
about each XFAIL, by going to:

        <https://git.sergiodj.net/gdb-xfails.git/tree/xfails/Fedora-i686/xfails/master/xfail.table?id=b24bdf1>



Reply | Threaded
Open this post in threaded view
|

*** COMPILATION FAILED *** Failures on Fedora-x86_64-w64-mingw32, branch master *** BREAKAGE ***

sergiodj+buildbot-2
In reply to this post by sergiodj+buildbot-2
Buildslave:
        fedora-x86-64-3

Full Build URL:
        <http://gdb-build.sergiodj.net/builders/Fedora-x86_64-w64-mingw32/builds/1730>

Commit(s) tested:
        035522c0228be33b2124ada2f178187e7e53aa6c

Author(s) (in the same order as the commits):
        Pedro Alves <[hidden email]>

Subject:
        Fix gdb.base/remote.exp with native-extended-gdbserver board

Testsuite log (gdb.sum and gdb.log) URL(s):
        <http://gdb-build.sergiodj.net/results/Fedora-x86_64-w64-mingw32/03/035522c0228be33b2124ada2f178187e7e53aa6c/>

*** Failed to compiled GDB.  ***
============================

+++ The full log is too big to be posted here.
+++ These are the last 100 lines of it.

 ^
../../binutils-gdb/bfd/archive.c: In function 'bfd_slurp_armap':
../../binutils-gdb/bfd/archive.c:1183:1: error: visibility attribute not supported in this configuration; ignored [-Werror=attributes]
 }
 ^
../../binutils-gdb/bfd/archive.c: In function '_bfd_slurp_extended_name_table':
../../binutils-gdb/bfd/archive.c:1278:1: error: visibility attribute not supported in this configuration; ignored [-Werror=attributes]
 }
 ^
../../binutils-gdb/bfd/archive.c: In function '_bfd_archive_bsd_construct_extended_name_table':
../../binutils-gdb/bfd/archive.c:1464:1: error: visibility attribute not supported in this configuration; ignored [-Werror=attributes]
 }
 ^
../../binutils-gdb/bfd/archive.c: In function '_bfd_archive_coff_construct_extended_name_table':
../../binutils-gdb/bfd/archive.c:1476:1: error: visibility attribute not supported in this configuration; ignored [-Werror=attributes]
 }
 ^
../../binutils-gdb/bfd/archive.c: In function '_bfd_noarchive_construct_extended_name_table':
../../binutils-gdb/bfd/archive.c:1485:1: error: visibility attribute not supported in this configuration; ignored [-Werror=attributes]
 }
 ^
../../binutils-gdb/bfd/archive.c: In function '_bfd_construct_extended_name_table':
../../binutils-gdb/bfd/archive.c:1685:1: error: visibility attribute not supported in this configuration; ignored [-Werror=attributes]
 }
 ^
../../binutils-gdb/bfd/archive.c: In function '_bfd_archive_bsd44_construct_extended_name_table':
../../binutils-gdb/bfd/archive.c:1729:1: error: visibility attribute not supported in this configuration; ignored [-Werror=attributes]
 }
 ^
../../binutils-gdb/bfd/archive.c: In function '_bfd_generic_write_ar_hdr':
../../binutils-gdb/bfd/archive.c:1741:1: error: visibility attribute not supported in this configuration; ignored [-Werror=attributes]
 }
 ^
../../binutils-gdb/bfd/archive.c: In function '_bfd_bsd44_write_ar_hdr':
../../binutils-gdb/bfd/archive.c:1784:1: error: visibility attribute not supported in this configuration; ignored [-Werror=attributes]
 }
 ^
../../binutils-gdb/bfd/archive.c: In function '_bfd_noarchive_write_ar_hdr':
../../binutils-gdb/bfd/archive.c:1790:1: error: visibility attribute not supported in this configuration; ignored [-Werror=attributes]
 }
 ^
../../binutils-gdb/bfd/archive.c: In function 'bfd_generic_stat_arch_elt':
../../binutils-gdb/bfd/archive.c:1963:1: error: visibility attribute not supported in this configuration; ignored [-Werror=attributes]
 }
 ^
../../binutils-gdb/bfd/archive.c: In function 'bfd_dont_truncate_arname':
../../binutils-gdb/bfd/archive.c:2000:1: error: visibility attribute not supported in this configuration; ignored [-Werror=attributes]
 }
 ^
../../binutils-gdb/bfd/archive.c: In function 'bfd_bsd_truncate_arname':
../../binutils-gdb/bfd/archive.c:2023:1: error: visibility attribute not supported in this configuration; ignored [-Werror=attributes]
 }
 ^
../../binutils-gdb/bfd/archive.c: In function 'bfd_gnu_truncate_arname':
../../binutils-gdb/bfd/archive.c:2060:1: error: visibility attribute not supported in this configuration; ignored [-Werror=attributes]
 }
 ^
../../binutils-gdb/bfd/archive.c: In function '_bfd_noarchive_truncate_arname':
../../binutils-gdb/bfd/archive.c:2067:1: error: visibility attribute not supported in this configuration; ignored [-Werror=attributes]
 }
 ^
../../binutils-gdb/bfd/archive.c: In function '_bfd_write_archive_contents':
../../binutils-gdb/bfd/archive.c:2226:1: error: visibility attribute not supported in this configuration; ignored [-Werror=attributes]
 }
 ^
../../binutils-gdb/bfd/archive.c: In function '_bfd_compute_and_write_armap':
../../binutils-gdb/bfd/archive.c:2382:1: error: visibility attribute not supported in this configuration; ignored [-Werror=attributes]
 }
 ^
../../binutils-gdb/bfd/archive.c: In function '_bfd_bsd_write_armap':
../../binutils-gdb/bfd/archive.c:2538:1: error: visibility attribute not supported in this configuration; ignored [-Werror=attributes]
 }
 ^
../../binutils-gdb/bfd/archive.c: In function '_bfd_archive_bsd_update_armap_timestamp':
../../binutils-gdb/bfd/archive.c:2593:1: error: visibility attribute not supported in this configuration; ignored [-Werror=attributes]
 }
 ^
../../binutils-gdb/bfd/archive.c: In function '_bfd_coff_write_armap':
../../binutils-gdb/bfd/archive.c:2746:1: error: visibility attribute not supported in this configuration; ignored [-Werror=attributes]
 }
 ^
../../binutils-gdb/bfd/archive.c: In function '_bfd_noarchive_write_armap':
../../binutils-gdb/bfd/archive.c:2757:1: error: visibility attribute not supported in this configuration; ignored [-Werror=attributes]
 }
 ^
../../binutils-gdb/bfd/archive.c: In function '_bfd_archive_close_and_cleanup':
../../binutils-gdb/bfd/archive.c:2815:1: error: visibility attribute not supported in this configuration; ignored [-Werror=attributes]
 }
 ^
cc1: all warnings being treated as errors
make[4]: *** [Makefile:1501: archive.lo] Error 1
make[4]: Leaving directory '/home/gdb-buildbot/fedora-x86-64-3/fedora-x86-64-mingw32/build/bfd'
make[3]: *** [Makefile:1544: all-recursive] Error 1
make[2]: *** [Makefile:1077: all] Error 2
make[1]: *** [Makefile:2696: all-bfd] Error 2
make[3]: Leaving directory '/home/gdb-buildbot/fedora-x86-64-3/fedora-x86-64-mingw32/build/bfd'
make[2]: Leaving directory '/home/gdb-buildbot/fedora-x86-64-3/fedora-x86-64-mingw32/build/bfd'
make[1]: Leaving directory '/home/gdb-buildbot/fedora-x86-64-3/fedora-x86-64-mingw32/build'
make: *** [Makefile:857: all] Error 2
============================



Reply | Threaded
Open this post in threaded view
|

Failures on Fedora-x86_64-cc-with-index, branch master

sergiodj+buildbot-2
In reply to this post by sergiodj+buildbot-2
Buildslave:
        fedora-x86-64-1

Full Build URL:
        <http://gdb-build.sergiodj.net/builders/Fedora-x86_64-cc-with-index/builds/9731>

Commit(s) tested:
        035522c0228be33b2124ada2f178187e7e53aa6c

Author(s) (in the same order as the commits):
        Pedro Alves <[hidden email]>

Subject:
        Fix gdb.base/remote.exp with native-extended-gdbserver board

Testsuite log (gdb.sum and gdb.log) URL(s):
        <http://gdb-build.sergiodj.net/results/Fedora-x86_64-cc-with-index/03/035522c0228be33b2124ada2f178187e7e53aa6c/>

*** Diff to previous build ***
============================
new KFAIL: gdb.base/foll-vfork.exp: exit: vfork child follow, finish after tcatch vfork: finish
PASS -> KFAIL: gdb.threads/process-dies-while-handling-bp.exp: non_stop=off: cond_bp_target=0: inferior 1 exited
PASS -> FAIL: gdb.threads/watchpoint-fork.exp: child: singlethreaded: finish
============================


*** Complete list of XFAILs for this builder ***

To obtain the list of XFAIL tests for this builder, go to:

        <https://git.sergiodj.net/gdb-xfails.git/tree/xfails/Fedora-x86_64-cc-with-index/xfails/master/xfail?id=6ab5eec>

You can also see a pretty-printed version of the list, with more information
about each XFAIL, by going to:

        <https://git.sergiodj.net/gdb-xfails.git/tree/xfails/Fedora-x86_64-cc-with-index/xfails/master/xfail.table?id=6ab5eec>



Reply | Threaded
Open this post in threaded view
|

Failures on Fedora-x86_64-native-extended-gdbserver-m64, branch master

sergiodj+buildbot-2
In reply to this post by sergiodj+buildbot-2
Buildslave:
        fedora-x86-64-4

Full Build URL:
        <http://gdb-build.sergiodj.net/builders/Fedora-x86_64-native-extended-gdbserver-m64/builds/9822>

Commit(s) tested:
        035522c0228be33b2124ada2f178187e7e53aa6c

Author(s) (in the same order as the commits):
        Pedro Alves <[hidden email]>

Subject:
        Fix gdb.base/remote.exp with native-extended-gdbserver board

Testsuite log (gdb.sum and gdb.log) URL(s):
        <http://gdb-build.sergiodj.net/results/Fedora-x86_64-native-extended-gdbserver-m64/03/035522c0228be33b2124ada2f178187e7e53aa6c/>

*** Diff to previous build ***
============================
PASS -> FAIL: gdb.ada/expr_delims.exp: continue
PASS -> FAIL: gdb.ada/expr_delims.exp: print variable 'thread'
PASS -> FAIL: gdb.ada/expr_delims.exp: set plain watchpoint on variable 'thread'
PASS -> FAIL: gdb.ada/expr_delims.exp: set conditional watchpoint.
PASS -> FAIL: gdb.ada/expr_delims.exp: check that watchpoint is set correctly.
PASS -> FAIL: gdb.ada/formatted_ref.exp: print/x s'access
PASS -> FAIL: gdb.ada/formatted_ref.exp: print s.x = 13
PASS -> FAIL: gdb.base/attach-non-pgrp-leader.exp: parent: continue to breakpoint: marker
PASS -> FAIL: gdb.base/attach-non-pgrp-leader.exp: parent: detach
PASS -> FAIL: gdb.base/attach-non-pgrp-leader.exp: child: continue to breakpoint: marker
PASS -> FAIL: gdb.base/attach-non-pgrp-leader.exp: child: detach
PASS -> FAIL: gdb.base/break-interp.exp: LDprelinkNOdebugNO: dl bt
PASS -> FAIL: gdb.base/break-interp.exp: LDprelinkNOdebugNO: BINprelinkNOdebugINpieYES: attach: attach
PASS -> FAIL: gdb.base/break-interp.exp: LDprelinkNOdebugNO: BINprelinkNOdebugINpieYES: attach: attach final prompt
PASS -> FAIL: gdb.base/break-interp.exp: LDprelinkNOdebugNO: BINprelinkNOdebugINpieYES: attach: seen displacement message as NONZERO
PASS -> FAIL: gdb.base/break-interp.exp: LDprelinkNOdebugNO: BINprelinkNOdebugINpieYES: attach: attach main bt
PASS -> FAIL: gdb.base/pie-fork.exp: test_no_detach_on_fork: continue
PASS -> FAIL: gdb.base/quit-live.exp: appear_how=attach: extra_inferior=1: quit_how=sighup: quit with SIGHUP
PASS -> FAIL: gdb.base/quit-live.exp: appear_how=attach-nofile: extra_inferior=0: quit_how=sigterm: quit with SIGTERM
PASS -> FAIL: gdb.mi/mi-var-child.exp: run to 229
new FAIL: gdb.mi/mi-var-child.exp: wait for stop
PASS -> FAIL: gdb.mi/mi-var-child.exp: create local variable struct_declarations
PASS -> FAIL: gdb.mi/mi-var-child.exp: get children of struct_declarations
PASS -> FAIL: gdb.mi/mi-var-child.exp: get number of children of struct_declarations
PASS -> FAIL: gdb.mi/mi-var-child.exp: get children of struct_declarations.integer
PASS -> FAIL: gdb.mi/mi-var-child.exp: get number of children of struct_declarations.integer
PASS -> FAIL: gdb.mi/mi-var-child.exp: get children of struct_declarations.character
PASS -> FAIL: gdb.mi/mi-var-child.exp: get number of children of struct_declarations.character
PASS -> FAIL: gdb.mi/mi-var-child.exp: get children of struct_declarations.char_ptr
PASS -> FAIL: gdb.mi/mi-var-child.exp: get number of children of struct_declarations.char_ptr
PASS -> FAIL: gdb.mi/mi-var-child.exp: get children of struct_declarations.long_int
PASS -> FAIL: gdb.mi/mi-var-child.exp: get number of children of struct_declarations.long_int
PASS -> FAIL: gdb.mi/mi-var-child.exp: get children of struct_declarations.int_ptr_ptr
PASS -> FAIL: gdb.mi/mi-var-child.exp: get number of children of struct_declarations.int_ptr_ptr
PASS -> FAIL: gdb.mi/mi-var-child.exp: get children of struct_declarations.long_array
PASS -> FAIL: gdb.mi/mi-var-child.exp: get number of children of struct_declarations.long_array
PASS -> FAIL: gdb.mi/mi-var-child.exp: get children of struct_declarations.func_ptr
PASS -> FAIL: gdb.mi/mi-var-child.exp: get number of children of struct_declarations.func_ptr
PASS -> FAIL: gdb.mi/mi-var-child.exp: get children of struct_declarations.func_ptr_struct
PASS -> FAIL: gdb.mi/mi-var-child.exp: get number of children of struct_declarations.func_ptr_struct
PASS -> FAIL: gdb.mi/mi-var-child.exp: get children of struct_declarations.func_ptr_ptr
PASS -> FAIL: gdb.mi/mi-var-child.exp: get number of children of struct_declarations.func_ptr_ptr
PASS -> FAIL: gdb.mi/mi-var-child.exp: get children of struct_declarations.u1
PASS -> FAIL: gdb.mi/mi-var-child.exp: get number of children of struct_declarations.u1
PASS -> FAIL: gdb.mi/mi-var-child.exp: get children of struct_declarations.s2
PASS -> FAIL: gdb.mi/mi-var-child.exp: get number of children of struct_declarations.s2
PASS -> FAIL: gdb.mi/mi-var-child.exp: get children of struct_declarations.long_array.1
PASS -> FAIL: gdb.mi/mi-var-child.exp: get number of children of struct_declarations.long_array.1
PASS -> FAIL: gdb.mi/mi-var-child.exp: get children of struct_declarations.long_array.2
PASS -> FAIL: gdb.mi/mi-var-child.exp: get number of children of struct_declarations.long_array.2
PASS -> FAIL: gdb.mi/mi-var-child.exp: get children of struct_declarations.long_array.3
PASS -> FAIL: gdb.mi/mi-var-child.exp: get number of children of struct_declarations.long_array.3
PASS -> FAIL: gdb.mi/mi-var-child.exp: get children of struct_declarations.long_array.4
PASS -> FAIL: gdb.mi/mi-var-child.exp: get number of children of struct_declarations.long_array.4
PASS -> FAIL: gdb.mi/mi-var-child.exp: get children of struct_declarations.long_array.5
PASS -> FAIL: gdb.mi/mi-var-child.exp: get number of children of struct_declarations.long_array.5
PASS -> FAIL: gdb.mi/mi-var-child.exp: get children of struct_declarations.long_array.6
PASS -> FAIL: gdb.mi/mi-var-child.exp: get number of children of struct_declarations.long_array.6
PASS -> FAIL: gdb.mi/mi-var-child.exp: get children of struct_declarations.long_array.7
PASS -> FAIL: gdb.mi/mi-var-child.exp: get number of children of struct_declarations.long_array.7
PASS -> FAIL: gdb.mi/mi-var-child.exp: get children of struct_declarations.long_array.8
PASS -> FAIL: gdb.mi/mi-var-child.exp: get number of children of struct_declarations.long_array.8
PASS -> FAIL: gdb.mi/mi-var-child.exp: get children of struct_declarations.long_array.9
PASS -> FAIL: gdb.mi/mi-var-child.exp: get number of children of struct_declarations.long_array.9
PASS -> FAIL: gdb.mi/mi-var-child.exp: get children of struct_declarations.u1.a
PASS -> FAIL: gdb.mi/mi-var-child.exp: get number of children of struct_declarations.u1.a
PASS -> FAIL: gdb.mi/mi-var-child.exp: get children of struct_declarations.u1.b
PASS -> FAIL: gdb.mi/mi-var-child.exp: get number of children of struct_declarations.u1.b
PASS -> FAIL: gdb.mi/mi-var-child.exp: get children of struct_declarations.u1.c
PASS -> FAIL: gdb.mi/mi-var-child.exp: get number of children of struct_declarations.u1.c
PASS -> FAIL: gdb.mi/mi-var-child.exp: get children of struct_declarations.u1.d
PASS -> FAIL: gdb.mi/mi-var-child.exp: get number of children of struct_declarations.u1.d
PASS -> FAIL: gdb.mi/mi-var-child.exp: get children of struct_declarations.s2.u2
PASS -> FAIL: gdb.mi/mi-var-child.exp: get number of children of struct_declarations.s2.u2
PASS -> FAIL: gdb.mi/mi-var-child.exp: get children of struct_declarations.s2.g
PASS -> FAIL: gdb.mi/mi-var-child.exp: get number of children of struct_declarations.s2.g
PASS -> FAIL: gdb.mi/mi-var-child.exp: get children of struct_declarations.s2.h
PASS -> FAIL: gdb.mi/mi-var-child.exp: get number of children of struct_declarations.s2.h
PASS -> FAIL: gdb.mi/mi-var-child.exp: get children of struct_declarations.s2.i
PASS -> FAIL: gdb.mi/mi-var-child.exp: get number of children of struct_declarations.s2.i
PASS -> FAIL: gdb.mi/mi-var-child.exp: get children of struct_declarations.s2.u2.u1s1
PASS -> FAIL: gdb.mi/mi-var-child.exp: get number of children of struct_declarations.s2.u2.u1s1
PASS -> FAIL: gdb.mi/mi-var-child.exp: get children of struct_declarations.s2.u2.f
PASS -> FAIL: gdb.mi/mi-var-child.exp: get number of children of struct_declarations.s2.u2.f
PASS -> FAIL: gdb.mi/mi-var-child.exp: get children of struct_declarations.s2.u2.u1s2
PASS -> FAIL: gdb.mi/mi-var-child.exp: get number of children of struct_declarations.s2.u2.u1s2
PASS -> FAIL: gdb.mi/mi-var-child.exp: get children of struct_declarations.s2.u2.u1s1.d
PASS -> FAIL: gdb.mi/mi-var-child.exp: get number of children of struct_declarations.s2.u2.u1s1.d
PASS -> FAIL: gdb.mi/mi-var-child.exp: get children of struct_declarations.s2.u2.u1s1.e
PASS -> FAIL: gdb.mi/mi-var-child.exp: get number of children of struct_declarations.s2.u2.u1s1.e
PASS -> FAIL: gdb.mi/mi-var-child.exp: get children of struct_declarations.s2.u2.u1s1.func
PASS -> FAIL: gdb.mi/mi-var-child.exp: get number of children of struct_declarations.s2.u2.u1s1.func
PASS -> FAIL: gdb.mi/mi-var-child.exp: get children of struct_declarations.s2.u2.u1s1.foo
PASS -> FAIL: gdb.mi/mi-var-child.exp: get number of children of struct_declarations.s2.u2.u1s1.foo
PASS -> FAIL: gdb.mi/mi-var-child.exp: get children of struct_declarations.s2.u2.u1s2.array_ptr
PASS -> FAIL: gdb.mi/mi-var-child.exp: get number of children of struct_declarations.s2.u2.u1s2.array_ptr
PASS -> FAIL: gdb.mi/mi-var-child.exp: get children of struct_declarations.s2.u2.u1s2.func
PASS -> FAIL: gdb.mi/mi-var-child.exp: get number of children of struct_declarations.s2.u2.u1s2.func
PASS -> FAIL: gdb.mi/mi-var-child.exp: get children of struct_declarations.int_ptr_ptr.*int_ptr_ptr
PASS -> FAIL: gdb.mi/mi-var-child.exp: get number of children of struct_declarations.int_ptr_ptr.*int_ptr_ptr
PASS -> FAIL: gdb.mi/mi-var-child.exp: step to line $line_dct_123
PASS -> FAIL: gdb.mi/mi-var-child.exp: create local variable weird
PASS -> FAIL: gdb.mi/mi-var-child.exp: get children of weird
PASS -> FAIL: gdb.mi/mi-var-child.exp: get number of children of weird
PASS -> FAIL: gdb.mi/mi-var-child.exp: get children of weird.long_array
PASS -> FAIL: gdb.mi/mi-var-child.exp: get number of children of weird.long_array
PASS -> FAIL: gdb.mi/mi-var-child.exp: get children of weird.int_ptr_ptr
PASS -> FAIL: gdb.mi/mi-var-child.exp: get number of children of weird.int_ptr_ptr
PASS -> FAIL: gdb.mi/mi-var-child.exp: get children of weird.int_ptr_ptr.*int_ptr_ptr
PASS -> FAIL: gdb.mi/mi-var-child.exp: get number of children of weird.int_ptr_ptr.*int_ptr_ptr
PASS -> FAIL: gdb.mi/mi-var-child.exp: create local variable weird->int_ptr_ptr
PASS -> FAIL: gdb.mi/mi-var-child.exp: get children of weird->int_ptr_ptr
PASS -> FAIL: gdb.mi/mi-var-child.exp: get number of children of weird->int_ptr_ptr
PASS -> FAIL: gdb.mi/mi-var-child.exp: get children of weird->int_ptr_ptr.*weird->int_ptr_ptr
PASS -> FAIL: gdb.mi/mi-var-child.exp: get number of children of weird->int_ptr_ptr.*weird->int_ptr_ptr
PASS -> FAIL: gdb.mi/mi-var-child.exp: get children of weird->int_ptr_ptr.*weird->int_ptr_ptr.**weird->int_ptr_ptr
PASS -> FAIL: gdb.mi/mi-var-child.exp: get number of children of weird->int_ptr_ptr.*weird->int_ptr_ptr.**weird->int_ptr_ptr
PASS -> FAIL: gdb.mi/mi-var-child.exp: is weird editable
PASS -> FAIL: gdb.mi/mi-var-child.exp: is weird->int_ptr_ptr editable
PASS -> FAIL: gdb.mi/mi-var-child.exp: is weird.int_ptr_ptr.*int_ptr_ptr editable
PASS -> FAIL: gdb.mi/mi-var-child.exp: is weird.int_ptr_ptr.*int_ptr_ptr.**int_ptr_ptr editable
PASS -> FAIL: gdb.mi/mi-var-child.exp: is weird.u1 editable
PASS -> FAIL: gdb.mi/mi-var-child.exp: is weird.s2 editable
PASS -> FAIL: gdb.mi/mi-var-child.exp: is struct_declarations.u1.a editable
PASS -> FAIL: gdb.mi/mi-var-child.exp: is struct_declarations.u1.b editable
PASS -> FAIL: gdb.mi/mi-var-child.exp: is struct_declarations.u1.c editable
PASS -> FAIL: gdb.mi/mi-var-child.exp: is struct_declarations.long_array editable
PASS -> FAIL: gdb.mi/mi-var-child.exp: is struct_declarations.long_array.0 editable
PASS -> FAIL: gdb.mi/mi-var-child.exp: is struct_declarations editable
PASS -> FAIL: gdb.mi/mi-var-child.exp: delete var weird
PASS -> FAIL: gdb.mi/mi-var-child.exp: step $line_dct_123 + 1
PASS -> FAIL: gdb.mi/mi-var-child.exp: update all vars struct_declarations.integer
PASS -> FAIL: gdb.mi/mi-var-child.exp: step $line_dct_123 + 4
PASS -> FAIL: gdb.mi/mi-var-child.exp: update all vars struct_declarations.char_ptr
PASS -> FAIL: gdb.mi/mi-var-child.exp: step $line_dct_123 + 5
PASS -> FAIL: gdb.mi/mi-var-child.exp: update all vars int_ptr_ptr and children changed
PASS -> FAIL: gdb.mi/mi-var-child.exp: step $line_dct_123 + 6
PASS -> FAIL: gdb.mi/mi-var-child.exp: update all vars struct_declarations.long_array.0 changed
PASS -> FAIL: gdb.mi/mi-var-child.exp: step $line_dct_123 + 7
PASS -> FAIL: gdb.mi/mi-var-child.exp: update all vars struct_declarations.long_array.1 changed
PASS -> FAIL: gdb.mi/mi-var-child.exp: step $line_dct_123 + 8
PASS -> FAIL: gdb.mi/mi-var-child.exp: update all vars struct_declarations.long_array.2 changed
PASS -> FAIL: gdb.mi/mi-var-child.exp: step $line_dct_nothing
PASS -> FAIL: gdb.mi/mi-var-child.exp: update all vars struct_declarations.long_array.3-9 changed
PASS -> FAIL: gdb.mi/mi-var-child.exp: step $line_dct_nothing + 1
PASS -> FAIL: gdb.mi/mi-var-child.exp: update all vars struct_declarations.func_ptr changed
PASS -> FAIL: gdb.mi/mi-var-child.exp: step $line_dct_nothing + 2
PASS -> FAIL: gdb.mi/mi-var-child.exp: update all vars struct_declarations.func_ptr_struct changed
PASS -> FAIL: gdb.mi/mi-var-child.exp: step $line_dct_nothing + 3
PASS -> FAIL: gdb.mi/mi-var-child.exp: update all vars struct_declarations.func_ptr_ptr changed
PASS -> FAIL: gdb.mi/mi-var-child.exp: step $line_dct_nothing + 4
PASS -> FAIL: gdb.mi/mi-var-child.exp: update all vars struct_declarations.long_array.10 changed, don't print values.
PASS -> FAIL: gdb.mi/mi-var-child.exp: step $line_dct_a0_0
PASS -> FAIL: gdb.mi/mi-var-child.exp: update all vars struct_declarations.long_array.11 changed, print values.
PASS -> FAIL: gdb.mi/mi-var-child.exp: listing of names and values of children
PASS -> FAIL: gdb.mi/mi-var-child.exp: listing of children, simple types: names, type and values, complex types: names and types
PASS -> FAIL: gdb.mi/mi-var-child.exp: delete var struct_declarations
PASS -> FAIL: gdb.mi/mi-var-child.exp: delete var weird->int_ptr_ptr
PASS -> FAIL: gdb.mi/mi-var-child.exp: step $line_dct_snp0 + 1
PASS -> FAIL: gdb.mi/mi-var-child.exp: create local variable  psnp->char_ptr
PASS -> FAIL: gdb.mi/mi-var-child.exp: get children of psnp->char_ptr
PASS -> FAIL: gdb.mi/mi-var-child.exp: get number of children of psnp->char_ptr
PASS -> FAIL: gdb.mi/mi-var-child.exp: get children of psnp->char_ptr.*psnp->char_ptr
PASS -> FAIL: gdb.mi/mi-var-child.exp: get number of children of psnp->char_ptr.*psnp->char_ptr
PASS -> FAIL: gdb.mi/mi-var-child.exp: get children of psnp->char_ptr.*psnp->char_ptr.**psnp->char_ptr
PASS -> FAIL: gdb.mi/mi-var-child.exp: get children of psnp->char_ptr.*psnp->char_ptr.**psnp->char_ptr.***psnp->char_ptr
PASS -> FAIL: gdb.mi/mi-var-child.exp: get number of children of psnp->char_ptr.*psnp->char_ptr.**psnp->char_ptr
PASS -> FAIL: gdb.mi/mi-var-child.exp: get number of children of psnp->char_ptr.*psnp->char_ptr.**psnp->char_ptr.***psnp->char_ptr
PASS -> FAIL: gdb.mi/mi-var-child.exp: get children of psnp->char_ptr.*psnp->char_ptr.**psnp->char_ptr.***psnp->char_ptr.****psnp->char_ptr
PASS -> FAIL: gdb.mi/mi-var-child.exp: get number of children of psnp->char_ptr.*psnp->char_ptr.**psnp->char_ptr.***psnp->char_ptr.****psnp->char_ptr
PASS -> FAIL: gdb.mi/mi-var-child.exp: create local variable  psnp->long_ptr
PASS -> FAIL: gdb.mi/mi-var-child.exp: get children of psnp->long_ptr
PASS -> FAIL: gdb.mi/mi-var-child.exp: get number of children of psnp->long_ptr
PASS -> FAIL: gdb.mi/mi-var-child.exp: get children of psnp->long_ptr.*psnp->long_ptr
PASS -> FAIL: gdb.mi/mi-var-child.exp: get number of children of psnp->long_ptr.*psnp->long_ptr
PASS -> FAIL: gdb.mi/mi-var-child.exp: get children of psnp->long_ptr.*psnp->long_ptr.**psnp->long_ptr
PASS -> FAIL: gdb.mi/mi-var-child.exp: get number of children of psnp->long_ptr.*psnp->long_ptr.**psnp->long_ptr
PASS -> FAIL: gdb.mi/mi-var-child.exp: get children of psnp->long_ptr.*psnp->long_ptr.**psnp->long_ptr.***psnp->long_ptr
PASS -> FAIL: gdb.mi/mi-var-child.exp: get number of children of psnp->long_ptr.*psnp->long_ptr.**psnp->long_ptr.***psnp->long_ptr
PASS -> FAIL: gdb.mi/mi-var-child.exp: get children of psnp->long_ptr.*psnp->long_ptr.**psnp->long_ptr.***psnp->long_ptr.****psnp->long_ptr
PASS -> FAIL: gdb.mi/mi-var-child.exp: get number of children of psnp->long_ptr.*psnp->long_ptr.**psnp->long_ptr.***psnp->long_ptr.****psnp->long_ptr
PASS -> FAIL: gdb.mi/mi-var-child.exp: create local variable  psnp->ptrs
PASS -> FAIL: gdb.mi/mi-var-child.exp: get children of psnp->ptrs
PASS -> FAIL: gdb.mi/mi-var-child.exp: get number of children of psnp->ptrs
PASS -> FAIL: gdb.mi/mi-var-child.exp: get children of psnp->ptrs.0
PASS -> FAIL: gdb.mi/mi-var-child.exp: get number of children of psnp->ptrs.0
PASS -> FAIL: gdb.mi/mi-var-child.exp: get children of psnp->ptrs.0.next
PASS -> FAIL: gdb.mi/mi-var-child.exp: get number of children of psnp->ptrs.0.next
PASS -> FAIL: gdb.mi/mi-var-child.exp: get children of psnp->ptrs.0.next.char_ptr
PASS -> FAIL: gdb.mi/mi-var-child.exp: get number of children of psnp->ptrs.0.next.char_ptr
PASS -> FAIL: gdb.mi/mi-var-child.exp: get children of psnp->ptrs.0.next.char_ptr.*char_ptr
PASS -> FAIL: gdb.mi/mi-var-child.exp: get number of children of psnp->ptrs.0.next.char_ptr.*char_ptr
PASS -> FAIL: gdb.mi/mi-var-child.exp: get children of psnp->ptrs.0.next.char_ptr.*char_ptr.**char_ptr
PASS -> FAIL: gdb.mi/mi-var-child.exp: get number of children of psnp->ptrs.0.next.char_ptr.*char_ptr.**char_ptr
PASS -> FAIL: gdb.mi/mi-var-child.exp: get children of psnp->ptrs.0.next.char_ptr.*char_ptr.**char_ptr.***char_ptr
PASS -> FAIL: gdb.mi/mi-var-child.exp: get number of children of psnp->ptrs.0.next.char_ptr.*char_ptr.**char_ptr.***char_ptr
PASS -> FAIL: gdb.mi/mi-var-child.exp: get children of psnp->ptrs.0.next.next
PASS -> FAIL: gdb.mi/mi-var-child.exp: get children of psnp->ptrs.0.next.next.ptrs
PASS -> FAIL: gdb.mi/mi-var-child.exp: step $line_dct_snp0 + 2
PASS -> FAIL: gdb.mi/mi-var-child.exp: update all vars psnp->char_ptr
PASS -> FAIL: gdb.mi/mi-var-child.exp: step $line_dct_snp0 + 3
PASS -> FAIL: gdb.mi/mi-var-child.exp: update all vars psnp->next->char_ptr
PASS -> FAIL: gdb.mi/mi-var-child.exp: step $line_dct_snp0 + 4
PASS -> FAIL: gdb.mi/mi-var-child.exp: update all vars psnp->next->next->char_ptr
PASS -> FAIL: gdb.mi/mi-var-child.exp: step $line_dct_snp0 + 5
PASS -> FAIL: gdb.mi/mi-var-child.exp: update all vars psnp->long_ptr
PASS -> FAIL: gdb.mi/mi-var-child.exp: step $line_dct_snp0 + 6
PASS -> FAIL: gdb.mi/mi-var-child.exp: step $line_dct_snp0 + 7
PASS -> FAIL: gdb.mi/mi-var-child.exp: update all vars psnp->next->next->long_ptr
new FAIL: gdb.mi/mi-var-child.exp: child_deletion: go to line 339
new FAIL: gdb.mi/mi-var-child.exp: child_deletion: step over 339
new KFAIL: gdb.mi/user-selected-context-sync.exp: mode=all-stop: test_mi_thread_select: thread 1.2 with --thread: thread-select, event on cli
new KFAIL: gdb.mi/user-selected-context-sync.exp: mode=non-stop: test_mi_thread_select: thread 1.2 with --thread: thread-select, event on cli
PASS -> FAIL: gdb.server/file-transfer.exp: compare intermediate binary file
PASS -> FAIL: gdb.server/file-transfer.exp: compare binary file
PASS -> FAIL: gdb.server/file-transfer.exp: compare intermediate text file
PASS -> FAIL: gdb.server/file-transfer.exp: compare text file
new FAIL: gdb.threads/watchthreads2.exp: run to thread_started
PASS -> FAIL: gdb.threads/watchthreads2.exp: all threads started
============================


*** Complete list of XFAILs for this builder ***

To obtain the list of XFAIL tests for this builder, go to:

        <https://git.sergiodj.net/gdb-xfails.git/tree/xfails/Fedora-x86_64-native-extended-gdbserver-m64/xfails/master/xfail?id=d3d9c05>

You can also see a pretty-printed version of the list, with more information
about each XFAIL, by going to:

        <https://git.sergiodj.net/gdb-xfails.git/tree/xfails/Fedora-x86_64-native-extended-gdbserver-m64/xfails/master/xfail.table?id=d3d9c05>



Reply | Threaded
Open this post in threaded view
|

Failures on Ubuntu-AArch32-m32, branch master

sergiodj+buildbot-2
In reply to this post by sergiodj+buildbot-2
Buildslave:
        ubuntu-trusty-aarch32-1

Full Build URL:
        <http://gdb-build.sergiodj.net/builders/Ubuntu-AArch32-m32/builds/3596>

Commit(s) tested:
        035522c0228be33b2124ada2f178187e7e53aa6c

Author(s) (in the same order as the commits):
        Pedro Alves <[hidden email]>

Subject:
        Fix gdb.base/remote.exp with native-extended-gdbserver board

Testsuite log (gdb.sum and gdb.log) URL(s):
        <http://gdb-build.sergiodj.net/results/Ubuntu-AArch32-m32/03/035522c0228be33b2124ada2f178187e7e53aa6c/>

*** Diff to previous build ***
============================
PASS -> KFAIL: gdb.threads/process-dies-while-handling-bp.exp: non_stop=on: cond_bp_target=1: inferior 1 exited
============================


*** Complete list of XFAILs for this builder ***

To obtain the list of XFAIL tests for this builder, go to:

        <https://git.sergiodj.net/gdb-xfails.git/tree/xfails/Ubuntu-AArch32-m32/xfails/master/xfail?id=>

You can also see a pretty-printed version of the list, with more information
about each XFAIL, by going to:

        <https://git.sergiodj.net/gdb-xfails.git/tree/xfails/Ubuntu-AArch32-m32/xfails/master/xfail.table?id=>



Reply | Threaded
Open this post in threaded view
|

Failures on Ubuntu-AArch32-native-extended-gdbserver-m32, branch master

sergiodj+buildbot-2
In reply to this post by sergiodj+buildbot-2
Buildslave:
        ubuntu-trusty-aarch32-1

Full Build URL:
        <http://gdb-build.sergiodj.net/builders/Ubuntu-AArch32-native-extended-gdbserver-m32/builds/3596>

Commit(s) tested:
        035522c0228be33b2124ada2f178187e7e53aa6c

Author(s) (in the same order as the commits):
        Pedro Alves <[hidden email]>

Subject:
        Fix gdb.base/remote.exp with native-extended-gdbserver board

Testsuite log (gdb.sum and gdb.log) URL(s):
        <http://gdb-build.sergiodj.net/results/Ubuntu-AArch32-native-extended-gdbserver-m32/03/035522c0228be33b2124ada2f178187e7e53aa6c/>

*** Diff to previous build ***
============================
new KFAIL: gdb.base/step-over-syscall.exp: clone: displaced=on: single step over clone
new FAIL: gdb.threads/interrupt-while-step-over.exp: displaced-stepping=off: iter=6: wait for stops
new FAIL: gdb.threads/interrupt-while-step-over.exp: displaced-stepping=off: iter=7: wait for stops
new FAIL: gdb.threads/interrupt-while-step-over.exp: displaced-stepping=off: iter=8: wait for stops
new FAIL: gdb.threads/interrupt-while-step-over.exp: displaced-stepping=off: iter=9: wait for stops
new FAIL: gdb.threads/interrupt-while-step-over.exp: displaced-stepping=off: iter=10: wait for stops
new FAIL: gdb.threads/interrupt-while-step-over.exp: displaced-stepping=off: iter=15: wait for stops
new FAIL: gdb.threads/interrupt-while-step-over.exp: displaced-stepping=off: iter=16: wait for stops
new FAIL: gdb.threads/queue-signal.exp: determine thread functions
============================


*** Complete list of XFAILs for this builder ***

FAILURE TO OBTAIN THE COMMIT FOR THE XFAIL LIST.  PLEASE CONTACT THE BUILDBOT ADMIN.