[binutils-gdb] Disable parts of gdb.base/source-dir.exp on remote host

classic Classic list List threaded Threaded
11 messages Options
Reply | Threaded
Open this post in threaded view
|

[binutils-gdb] Disable parts of gdb.base/source-dir.exp on remote host

Sourceware - gdb-testers mailing list
*** TEST RESULTS FOR COMMIT e822f2cda9bc484adb5f8860050640a5c6f1ced9 ***

commit e822f2cda9bc484adb5f8860050640a5c6f1ced9
Author:     Sandra Loosemore <[hidden email]>
AuthorDate: Mon Jun 22 10:10:02 2020 -0700
Commit:     Sandra Loosemore <[hidden email]>
CommitDate: Mon Jun 22 10:10:02 2020 -0700

    Disable parts of gdb.base/source-dir.exp on remote host
   
    One set of tests in this file does a lot of complicated directory
    manipulations to force a specific DW_AT_comp_dir format and gdb
    directory search path.  As it's written, everything assumes host ==
    build, and it does not seem to me that there is any obvious way to
    rewrite this so it will work in general on remote host.  For instance,
    our harness for testing on remote Windows host normally does all
    compilation and GDB execution in $cwd using relative pathnames and I'm
    not sure all these directory tricks would set up the scenario it's
    trying to test even if they were correctly performed on host rather
    than build.  So I think it's reasonable just to disable this on remote
    host instead.
   
    I also noted that it's using the wrong search path syntax for Windows
    host in the "set directories" command and conditionalized that while I
    was looking at it.  That's a necessary fix to make this work in a
    situation where host == build and it's Windows, but I'm not actually
    set up to test that it's sufficient, too.
   
    2020-06-22  Sandra Loosemore  <[hidden email]>
   
            gdb/testsuite/
            * gdb.base/source-dir.exp (test_truncated_comp_dir): Skip on
            remote host.  Fix search path syntax on Windows host.

diff --git a/gdb/testsuite/ChangeLog b/gdb/testsuite/ChangeLog
index 5d64783df5..1d3c764de0 100644
--- a/gdb/testsuite/ChangeLog
+++ b/gdb/testsuite/ChangeLog
@@ -1,3 +1,8 @@
+2020-06-22  Sandra Loosemore  <[hidden email]>
+
+ * gdb.base/source-dir.exp (test_truncated_comp_dir): Skip on
+ remote host.  Fix search path syntax on Windows host.
+
 2020-06-21  Philippe Waroquiers  <[hidden email]>
 
  * gdb.base/attach.exp: Test priority of 'exec-file' changed
diff --git a/gdb/testsuite/gdb.base/source-dir.exp b/gdb/testsuite/gdb.base/source-dir.exp
index 8f70352dcc..093dda7b92 100644
--- a/gdb/testsuite/gdb.base/source-dir.exp
+++ b/gdb/testsuite/gdb.base/source-dir.exp
@@ -81,6 +81,12 @@ proc test_truncated_comp_dir {} {
     # find the source file no matter what we added to the directory
     # search path, this should now be fixed.
 
+    # All of these pathname and directory manipulations assume
+    # host == build, so do not attempt this set of tests on remote host.
+    if [is_remote host] {
+        return
+    }
+
     set original_dir [pwd]
     set working_dir [standard_output_file ""]
     cd ${working_dir}
@@ -108,7 +114,11 @@ proc test_truncated_comp_dir {} {
 
     clean_restart ${binfile}
 
-    gdb_test_no_output "set directories \$cdir:\$cwd"
+    if { [ishost *-*-mingw*] } {
+        gdb_test_no_output "set directories \$cdir;\$cwd"
+    } else {
+ gdb_test_no_output "set directories \$cdir:\$cwd"
+    }
     gdb_test "show directories" \
  "\r\nSource directories searched: \\\$cdir\[:;\]\\\$cwd"
 
Reply | Threaded
Open this post in threaded view
|

Failures on Ubuntu-Aarch64-native-extended-gdbserver-m64, branch master

Sourceware - gdb-testers mailing list
Buildername:
        Ubuntu-Aarch64-native-extended-gdbserver-m64

Worker:
        ubuntu-aarch64

Full Build URL:
        https://gdb-buildbot.osci.io/#builders/5/builds/3131

Author:
        Sandra Loosemore <[hidden email]>

Commit tested:
        e822f2cda9bc484adb5f8860050640a5c6f1ced9

Subject of commit:
        Disable parts of gdb.base/source-dir.exp on remote host

Testsuite logs (gdb.sum, gdb.log and others):
        https://gdb-buildbot.osci.io/results/Ubuntu-Aarch64-native-extended-gdbserver-m64/e8/e822f2cda9bc484adb5f8860050640a5c6f1ced9/

*** Diff to previous build ***
==============================================
new UNRESOLVED: gdb.opencl/callfuncs.exp: OpenCL support not detected
==============================================

*** Complete list of XFAILs for this builder ***

To obtain the list of XFAIL tests for this builder, go to:

        <https://gdb-buildbot.osci.io/results/Ubuntu-Aarch64-native-extended-gdbserver-m64/e8/e822f2cda9bc484adb5f8860050640a5c6f1ced9//xfail.gz>

You can also see a pretty-printed version of the list, with more information
about each XFAIL, by going to:

        <https://gdb-buildbot.osci.io/results/Ubuntu-Aarch64-native-extended-gdbserver-m64/e8/e822f2cda9bc484adb5f8860050640a5c6f1ced9//xfail.table.gz>

Reply | Threaded
Open this post in threaded view
|

Failures on Ubuntu-Aarch64-native-gdbserver-m64, branch master

Sourceware - gdb-testers mailing list
In reply to this post by Sourceware - gdb-testers mailing list
Buildername:
        Ubuntu-Aarch64-native-gdbserver-m64

Worker:
        ubuntu-aarch64

Full Build URL:
        https://gdb-buildbot.osci.io/#builders/19/builds/3172

Author:
        Sandra Loosemore <[hidden email]>

Commit tested:
        e822f2cda9bc484adb5f8860050640a5c6f1ced9

Subject of commit:
        Disable parts of gdb.base/source-dir.exp on remote host

Testsuite logs (gdb.sum, gdb.log and others):
        https://gdb-buildbot.osci.io/results/Ubuntu-Aarch64-native-gdbserver-m64/e8/e822f2cda9bc484adb5f8860050640a5c6f1ced9/

*** Diff to previous build ***
==============================================
PASS -> KFAIL: gdb.threads/process-dies-while-handling-bp.exp: non_stop=off: cond_bp_target=0: inferior 1 exited
==============================================

*** Complete list of XFAILs for this builder ***

To obtain the list of XFAIL tests for this builder, go to:

        <https://gdb-buildbot.osci.io/results/Ubuntu-Aarch64-native-gdbserver-m64/e8/e822f2cda9bc484adb5f8860050640a5c6f1ced9//xfail.gz>

You can also see a pretty-printed version of the list, with more information
about each XFAIL, by going to:

        <https://gdb-buildbot.osci.io/results/Ubuntu-Aarch64-native-gdbserver-m64/e8/e822f2cda9bc484adb5f8860050640a5c6f1ced9//xfail.table.gz>

Reply | Threaded
Open this post in threaded view
|

*** COMPILATION FAILED *** Failures on Fedora-i686, branch master *** BREAKAGE ***

gdb-buildbot-2
In reply to this post by Sourceware - gdb-testers mailing list
Buildername:
        Fedora-i686

Worker:
        fedora-x86-64-4

Full Build URL:
        https://gdb-buildbot.osci.io/#builders/18/builds/3536

Author:
        Sandra Loosemore <[hidden email]>

Commit tested:
        e822f2cda9bc484adb5f8860050640a5c6f1ced9

Subject of commit:
        Disable parts of gdb.base/source-dir.exp on remote host

*** FAILED to build GDB -- compile gdb ***
==============================================

+++ The full log is too big to be posted here.
+++ These are the last 100 lines of it.

  CXX    user-regs.o
  CXX    utils.o
  CXX    v850-tdep.o
  CXX    valarith.o
  CXX    valops.o
  CXX    valprint.o
  CXX    value.o
  CXX    varobj.o
  CXX    vax-nbsd-tdep.o
  CXX    vax-tdep.o
  GEN    stamp-version
  CXX    windows-tdep.o
  CXX    x86-linux-nat.o
  CXX    x86-nat.o
  CXX    x86-tdep.o
  CXX    xcoffread.o
  GEN    xml-builtin.c
  CXX    xml-support.o
  CXX    xml-syscall.o
  CXX    xml-tdesc.o
  CXX    xstormy16-tdep.o
  CXX    xtensa-config.o
  CXX    xtensa-linux-tdep.o
  CXX    xtensa-tdep.o
  CXX    gdb.o
  CXX    aarch32-tdep.o
  CXX    ada-exp.o
  CXX    ada-lang.o
  CXX    ada-tasks.o
  CXX    ada-typeprint.o
  CXX    ada-valprint.o
  CXX    ada-varobj.o
  CXX    addrmap.o
  CXX    agent.o
  CXX    alloc.o
  CXX    annotate.o
  CXX    arc-tdep.o
  CXX    arch-utils.o
  CXX    arch/aarch32.o
  CXX    arch/arc.o
  CXX    arch/arm-get-next-pcs.o
  CXX    arch/arm-linux.o
  CXX    arch/arm.o
  CXX    arch/i386.o
  CXX    arch/ppc-linux-common.o
  CXX    arch/riscv.o
  CXX    arm-bsd-tdep.o
  CXX    arm-fbsd-tdep.o
  CXX    arm-linux-tdep.o
  CXX    arm-nbsd-tdep.o
  CXX    arm-obsd-tdep.o
  CXX    arm-pikeos-tdep.o
  CXX    arm-symbian-tdep.o
  CXX    arm-tdep.o
  CXX    arm-wince-tdep.o
  CXX    async-event.o
  CXX    auto-load.o
  CXX    auxv.o
  CXX    avr-tdep.o
  CXX    ax-gdb.o
  CXX    ax-general.o
  CXX    bcache.o
  CXX    bfd-target.o
  CXX    bfin-linux-tdep.o
  CXX    bfin-tdep.o
  CXX    block.o
  CXX    blockframe.o
  CXX    break-catch-sig.o
  CXX    break-catch-syscall.o
  CXX    break-catch-throw.o
  CXX    breakpoint.o
  CXX    bsd-uthread.o
  CXX    btrace.o
  CXX    build-id.o
  CXX    buildsym-legacy.o
  CXX    buildsym.o
  CXX    c-exp.o
  CXX    cp-name-parser.o
  CXX    d-exp.o
  CXX    f-exp.o
  CXX    go-exp.o
  CXX    m2-exp.o
  CXX    p-exp.o
  CXX    rust-exp.o
  CXX    version.o
  CXX    xml-builtin.o
  GEN    init.c
  CXX    init.o
  CXXLD  gdb
/usr/bin/ld: ../opcodes/libopcodes.a(riscv-dis.o): in function `parse_riscv_dis_option':
/home/gdb-buildbot-2/fedora-x86-64-4/fedora-i686/build/opcodes/../../binutils-gdb/opcodes/riscv-dis.c:102: undefined reference to `riscv_get_priv_spec_class'
collect2: error: ld returned 1 exit status
make[2]: *** [Makefile:1861: gdb] Error 1
make[1]: *** [Makefile:10066: all-gdb] Error 2
make: *** [Makefile:854: all] Error 2
make[2]: Leaving directory '/home/gdb-buildbot-2/fedora-x86-64-4/fedora-i686/build/gdb'
make[1]: Leaving directory '/home/gdb-buildbot-2/fedora-x86-64-4/fedora-i686/build'
program finished with exit code 2
elapsedTime=461.325964
==============================================

Reply | Threaded
Open this post in threaded view
|

Failures on Fedora-x86_64-cc-with-index, branch master

gdb-buildbot-2
In reply to this post by Sourceware - gdb-testers mailing list
Buildername:
        Fedora-x86_64-cc-with-index

Worker:
        fedora-x86-64-4

Full Build URL:
        https://gdb-buildbot.osci.io/#builders/20/builds/3484

Author:
        Sandra Loosemore <[hidden email]>

Commit tested:
        e822f2cda9bc484adb5f8860050640a5c6f1ced9

Subject of commit:
        Disable parts of gdb.base/source-dir.exp on remote host

Testsuite logs (gdb.sum, gdb.log and others):
        https://gdb-buildbot.osci.io/results/Fedora-x86_64-cc-with-index/e8/e822f2cda9bc484adb5f8860050640a5c6f1ced9/

*** Diff to previous build ***
==============================================
PASS -> FAIL: gdb.multi/multi-arch-exec.exp: first_arch=1: selected_thread=1: follow_exec_mode=new: continue across exec that changes architecture
PASS -> KFAIL: gdb.threads/omp-par-scope.exp: nested_func: 2nd call: 2nd thread: print k
PASS -> KFAIL: gdb.threads/omp-par-scope.exp: nested_func: 2nd call: 2nd thread: print r
PASS -> KFAIL: gdb.threads/omp-par-scope.exp: nested_func: 2nd call: 2nd thread: print z
PASS -> KFAIL: gdb.threads/omp-par-scope.exp: nested_parallel: inner_threads: 3rd stop: print i
PASS -> KFAIL: gdb.threads/omp-par-scope.exp: nested_parallel: inner_threads: 3rd stop: print j
PASS -> KFAIL: gdb.threads/omp-par-scope.exp: single_scope: first thread: print i3
==============================================

*** Complete list of XFAILs for this builder ***

To obtain the list of XFAIL tests for this builder, go to:

        <https://gdb-buildbot.osci.io/results/Fedora-x86_64-cc-with-index/e8/e822f2cda9bc484adb5f8860050640a5c6f1ced9//xfail.gz>

You can also see a pretty-printed version of the list, with more information
about each XFAIL, by going to:

        <https://gdb-buildbot.osci.io/results/Fedora-x86_64-cc-with-index/e8/e822f2cda9bc484adb5f8860050640a5c6f1ced9//xfail.table.gz>

Reply | Threaded
Open this post in threaded view
|

Failures on Fedora-x86_64-m32, branch master

gdb-buildbot-2
In reply to this post by Sourceware - gdb-testers mailing list
Buildername:
        Fedora-x86_64-m32

Worker:
        fedora-x86-64-3

Full Build URL:
        https://gdb-buildbot.osci.io/#builders/17/builds/3530

Author:
        Sandra Loosemore <[hidden email]>

Commit tested:
        e822f2cda9bc484adb5f8860050640a5c6f1ced9

Subject of commit:
        Disable parts of gdb.base/source-dir.exp on remote host

Testsuite logs (gdb.sum, gdb.log and others):
        https://gdb-buildbot.osci.io/results/Fedora-x86_64-m32/e8/e822f2cda9bc484adb5f8860050640a5c6f1ced9/

*** Diff to previous build ***
==============================================
new FAIL: gdb.base/coredump-filter.exp: disassembling function main for non-Private-Anonymous: no binary: loading /home/gdb-buildbot/fedora-x86-64-3/fedora-x86-64-m32/build/gdb/testsuite/outputs/gdb.base/coredump-filter/non-private-anon.gcore
new FAIL: gdb.base/coredump-filter.exp: loading and testing corefile for non-Shared-Anonymous: loading /home/gdb-buildbot/fedora-x86-64-3/fedora-x86-64-m32/build/gdb/testsuite/outputs/gdb.base/coredump-filter/non-shared-anon.gcore
PASS -> FAIL: gdb.gdb/selftest.exp: backtrace through signal handler
PASS -> FAIL: gdb.multi/multi-arch-exec.exp: first_arch=1: selected_thread=1: follow_exec_mode=new: continue across exec that changes architecture
PASS -> KFAIL: gdb.threads/process-dies-while-handling-bp.exp: non_stop=off: cond_bp_target=0: inferior 1 exited
PASS -> KFAIL: gdb.threads/process-dies-while-handling-bp.exp: non_stop=off: cond_bp_target=1: inferior 1 exited
PASS -> KFAIL: gdb.threads/process-dies-while-handling-bp.exp: non_stop=on: cond_bp_target=0: inferior 1 exited
PASS -> KFAIL: gdb.threads/process-dies-while-handling-bp.exp: non_stop=on: cond_bp_target=1: inferior 1 exited
==============================================

*** Complete list of XFAILs for this builder ***

To obtain the list of XFAIL tests for this builder, go to:

        <https://gdb-buildbot.osci.io/results/Fedora-x86_64-m32/e8/e822f2cda9bc484adb5f8860050640a5c6f1ced9//xfail.gz>

You can also see a pretty-printed version of the list, with more information
about each XFAIL, by going to:

        <https://gdb-buildbot.osci.io/results/Fedora-x86_64-m32/e8/e822f2cda9bc484adb5f8860050640a5c6f1ced9//xfail.table.gz>

Reply | Threaded
Open this post in threaded view
|

Failures on Fedora-x86_64-m64, branch master

gdb-buildbot-2
In reply to this post by Sourceware - gdb-testers mailing list
Buildername:
        Fedora-x86_64-m64

Worker:
        fedora-x86-64-4

Full Build URL:
        https://gdb-buildbot.osci.io/#builders/3/builds/3593

Author:
        Sandra Loosemore <[hidden email]>

Commit tested:
        e822f2cda9bc484adb5f8860050640a5c6f1ced9

Subject of commit:
        Disable parts of gdb.base/source-dir.exp on remote host

Testsuite logs (gdb.sum, gdb.log and others):
        https://gdb-buildbot.osci.io/results/Fedora-x86_64-m64/e8/e822f2cda9bc484adb5f8860050640a5c6f1ced9/

*** Diff to previous build ***
==============================================
PASS -> KFAIL: gdb.threads/omp-par-scope.exp: nested_parallel: inner_threads: 2nd stop: print i
PASS -> KFAIL: gdb.threads/omp-par-scope.exp: nested_parallel: inner_threads: 2nd stop: print j
PASS -> KFAIL: gdb.threads/omp-par-scope.exp: nested_parallel: outer_threads: outer stop: print i
PASS -> KFAIL: gdb.threads/omp-par-scope.exp: nested_parallel: outer_threads: outer stop: print j
PASS -> KFAIL: gdb.threads/omp-par-scope.exp: single_scope: first thread: print i3
PASS -> KFAIL: gdb.threads/process-dies-while-handling-bp.exp: non_stop=on: cond_bp_target=1: inferior 1 exited
PASS -> FAIL: gdb.tui/completion.exp: completion of focus command: quit command input
PASS -> FAIL: gdb.tui/completion.exp: completion of focus command: tab completion
PASS -> FAIL: gdb.tui/completion.exp: completion of layout names: quit command input
==============================================

*** Complete list of XFAILs for this builder ***

To obtain the list of XFAIL tests for this builder, go to:

        <https://gdb-buildbot.osci.io/results/Fedora-x86_64-m64/e8/e822f2cda9bc484adb5f8860050640a5c6f1ced9//xfail.gz>

You can also see a pretty-printed version of the list, with more information
about each XFAIL, by going to:

        <https://gdb-buildbot.osci.io/results/Fedora-x86_64-m64/e8/e822f2cda9bc484adb5f8860050640a5c6f1ced9//xfail.table.gz>

Reply | Threaded
Open this post in threaded view
|

Failures on Fedora-x86_64-native-extended-gdbserver-m32, branch master

gdb-buildbot-2
In reply to this post by Sourceware - gdb-testers mailing list
Buildername:
        Fedora-x86_64-native-extended-gdbserver-m32

Worker:
        fedora-x86-64-3

Full Build URL:
        https://gdb-buildbot.osci.io/#builders/4/builds/3426

Author:
        Sandra Loosemore <[hidden email]>

Commit tested:
        e822f2cda9bc484adb5f8860050640a5c6f1ced9

Subject of commit:
        Disable parts of gdb.base/source-dir.exp on remote host

Testsuite logs (gdb.sum, gdb.log and others):
        https://gdb-buildbot.osci.io/results/Fedora-x86_64-native-extended-gdbserver-m32/e8/e822f2cda9bc484adb5f8860050640a5c6f1ced9/

*** Diff to previous build ***
==============================================
PASS -> FAIL: gdb.fortran/vla-ptype.exp: ptype vla1
PASS -> FAIL: gdb.fortran/vla-value.exp: print member in non-allocated vla1
PASS -> FAIL: gdb.fortran/vla-value.exp: set member in non-allocated vla1
PASS -> FAIL: gdb.multi/multi-re-run.exp: re_run_inf=1: iter=1: continue until exit
PASS -> FAIL: gdb.multi/multi-re-run.exp: re_run_inf=1: iter=1: print re_run_var_1
new UNRESOLVED: gdb.multi/multi-re-run.exp: re_run_inf=1: iter=2: delete all breakpoints in delete_breakpoints
PASS -> UNRESOLVED: gdb.multi/multi-re-run.exp: re_run_inf=1: iter=2: setting breakpoint at all_started
PASS -> FAIL: gdb.multi/multi-re-run.exp: re_run_inf=2: iter=1: continue until exit
PASS -> FAIL: gdb.multi/multi-re-run.exp: re_run_inf=2: iter=1: print re_run_var_2
new UNRESOLVED: gdb.multi/multi-re-run.exp: re_run_inf=2: iter=2: delete all breakpoints in delete_breakpoints
PASS -> UNRESOLVED: gdb.multi/multi-re-run.exp: re_run_inf=2: iter=2: setting breakpoint at all_started
PASS -> FAIL: gdb.threads/attach-many-short-lived-threads.exp: iter 10: break at break_fn: 1
PASS -> FAIL: gdb.threads/attach-many-short-lived-threads.exp: iter 10: break at break_fn: 2
PASS -> FAIL: gdb.threads/attach-many-short-lived-threads.exp: iter 10: break at break_fn: 3
PASS -> FAIL: gdb.threads/attach-many-short-lived-threads.exp: iter 9: break at break_fn: 1
PASS -> FAIL: gdb.threads/attach-many-short-lived-threads.exp: iter 9: break at break_fn: 2
PASS -> FAIL: gdb.threads/attach-many-short-lived-threads.exp: iter 9: break at break_fn: 3
PASS -> FAIL: gdb.threads/attach-many-short-lived-threads.exp: iter 9: detach
PASS -> FAIL: gdb.threads/attach-many-short-lived-threads.exp: iter 9: reset timer in the inferior
PASS -> FAIL: gdb.threads/interrupted-hand-call.exp: continue until exit
PASS -> KFAIL: gdb.threads/process-dies-while-handling-bp.exp: non_stop=off: cond_bp_target=1: inferior 1 exited
PASS -> FAIL: gdb.threads/thread-unwindonsignal.exp: continue until exit
PASS -> FAIL: gdb.trace/mi-tsv-changed.exp: create delete modify: tvariable $tvar3 modified
==============================================

*** Complete list of XFAILs for this builder ***

To obtain the list of XFAIL tests for this builder, go to:

        <https://gdb-buildbot.osci.io/results/Fedora-x86_64-native-extended-gdbserver-m32/e8/e822f2cda9bc484adb5f8860050640a5c6f1ced9//xfail.gz>

You can also see a pretty-printed version of the list, with more information
about each XFAIL, by going to:

        <https://gdb-buildbot.osci.io/results/Fedora-x86_64-native-extended-gdbserver-m32/e8/e822f2cda9bc484adb5f8860050640a5c6f1ced9//xfail.table.gz>

Reply | Threaded
Open this post in threaded view
|

Failures on Fedora-x86_64-native-extended-gdbserver-m64, branch master

gdb-buildbot-2
In reply to this post by Sourceware - gdb-testers mailing list
Buildername:
        Fedora-x86_64-native-extended-gdbserver-m64

Worker:
        fedora-x86-64-4

Full Build URL:
        https://gdb-buildbot.osci.io/#builders/2/builds/3427

Author:
        Sandra Loosemore <[hidden email]>

Commit tested:
        e822f2cda9bc484adb5f8860050640a5c6f1ced9

Subject of commit:
        Disable parts of gdb.base/source-dir.exp on remote host

Testsuite logs (gdb.sum, gdb.log and others):
        https://gdb-buildbot.osci.io/results/Fedora-x86_64-native-extended-gdbserver-m64/e8/e822f2cda9bc484adb5f8860050640a5c6f1ced9/

*** Diff to previous build ***
==============================================
PASS -> FAIL: gdb.multi/multi-re-run.exp: re_run_inf=1: iter=1: continue until exit
PASS -> FAIL: gdb.multi/multi-re-run.exp: re_run_inf=1: iter=1: print re_run_var_1
new UNRESOLVED: gdb.multi/multi-re-run.exp: re_run_inf=1: iter=2: delete all breakpoints in delete_breakpoints
PASS -> UNRESOLVED: gdb.multi/multi-re-run.exp: re_run_inf=1: iter=2: setting breakpoint at all_started
PASS -> FAIL: gdb.multi/multi-re-run.exp: re_run_inf=2: iter=2: continue until exit
PASS -> FAIL: gdb.multi/multi-re-run.exp: re_run_inf=2: iter=2: print re_run_var_2
PASS -> KFAIL: gdb.threads/omp-par-scope.exp: nested_func: 1st call: 1st thread: print k
PASS -> KFAIL: gdb.threads/omp-par-scope.exp: nested_func: 1st call: 1st thread: print r
PASS -> KFAIL: gdb.threads/omp-par-scope.exp: nested_func: 1st call: 1st thread: print z
PASS -> FAIL: gdb.threads/thread-unwindonsignal.exp: continue until exit
==============================================

*** Complete list of XFAILs for this builder ***

To obtain the list of XFAIL tests for this builder, go to:

        <https://gdb-buildbot.osci.io/results/Fedora-x86_64-native-extended-gdbserver-m64/e8/e822f2cda9bc484adb5f8860050640a5c6f1ced9//xfail.gz>

You can also see a pretty-printed version of the list, with more information
about each XFAIL, by going to:

        <https://gdb-buildbot.osci.io/results/Fedora-x86_64-native-extended-gdbserver-m64/e8/e822f2cda9bc484adb5f8860050640a5c6f1ced9//xfail.table.gz>

Reply | Threaded
Open this post in threaded view
|

Failures on Fedora-x86_64-native-gdbserver-m32, branch master

gdb-buildbot-2
In reply to this post by Sourceware - gdb-testers mailing list
Buildername:
        Fedora-x86_64-native-gdbserver-m32

Worker:
        fedora-x86-64-3

Full Build URL:
        https://gdb-buildbot.osci.io/#builders/24/builds/3439

Author:
        Sandra Loosemore <[hidden email]>

Commit tested:
        e822f2cda9bc484adb5f8860050640a5c6f1ced9

Subject of commit:
        Disable parts of gdb.base/source-dir.exp on remote host

Testsuite logs (gdb.sum, gdb.log and others):
        https://gdb-buildbot.osci.io/results/Fedora-x86_64-native-gdbserver-m32/e8/e822f2cda9bc484adb5f8860050640a5c6f1ced9/

*** Diff to previous build ***
==============================================
PASS -> FAIL: gdb.multi/multi-re-run.exp: re_run_inf=1: iter=2: continue until exit
PASS -> FAIL: gdb.multi/multi-re-run.exp: re_run_inf=1: iter=2: print re_run_var_1
PASS -> FAIL: gdb.trace/mi-tsv-changed.exp: create delete modify: tvariable $tvar3 modified
==============================================

*** Complete list of XFAILs for this builder ***

To obtain the list of XFAIL tests for this builder, go to:

        <https://gdb-buildbot.osci.io/results/Fedora-x86_64-native-gdbserver-m32/e8/e822f2cda9bc484adb5f8860050640a5c6f1ced9//xfail.gz>

You can also see a pretty-printed version of the list, with more information
about each XFAIL, by going to:

        <https://gdb-buildbot.osci.io/results/Fedora-x86_64-native-gdbserver-m32/e8/e822f2cda9bc484adb5f8860050640a5c6f1ced9//xfail.table.gz>

Reply | Threaded
Open this post in threaded view
|

Failures on Fedora-x86_64-native-gdbserver-m64, branch master

gdb-buildbot-2
In reply to this post by Sourceware - gdb-testers mailing list
Buildername:
        Fedora-x86_64-native-gdbserver-m64

Worker:
        fedora-x86-64-4

Full Build URL:
        https://gdb-buildbot.osci.io/#builders/22/builds/3438

Author:
        Sandra Loosemore <[hidden email]>

Commit tested:
        e822f2cda9bc484adb5f8860050640a5c6f1ced9

Subject of commit:
        Disable parts of gdb.base/source-dir.exp on remote host

Testsuite logs (gdb.sum, gdb.log and others):
        https://gdb-buildbot.osci.io/results/Fedora-x86_64-native-gdbserver-m64/e8/e822f2cda9bc484adb5f8860050640a5c6f1ced9/

*** Diff to previous build ***
==============================================
PASS -> FAIL: gdb.linespec/explicit.exp: complete non-unique label name: cmd complete "b -function myfunction -label "
PASS -> FAIL: gdb.linespec/explicit.exp: complete non-unique label name: tab complete "b -function myfunction -label "
PASS -> KFAIL: gdb.threads/omp-par-scope.exp: nested_func: 1st call: 1st thread: print k
PASS -> KFAIL: gdb.threads/omp-par-scope.exp: nested_func: 1st call: 1st thread: print r
PASS -> KFAIL: gdb.threads/omp-par-scope.exp: nested_func: 1st call: 1st thread: print z
PASS -> KFAIL: gdb.threads/omp-par-scope.exp: nested_parallel: inner_threads: 4th stop: print i
PASS -> KFAIL: gdb.threads/omp-par-scope.exp: nested_parallel: inner_threads: 4th stop: print j
PASS -> KFAIL: gdb.threads/omp-par-scope.exp: single_scope: second thread: print i3
==============================================

*** Complete list of XFAILs for this builder ***

To obtain the list of XFAIL tests for this builder, go to:

        <https://gdb-buildbot.osci.io/results/Fedora-x86_64-native-gdbserver-m64/e8/e822f2cda9bc484adb5f8860050640a5c6f1ced9//xfail.gz>

You can also see a pretty-printed version of the list, with more information
about each XFAIL, by going to:

        <https://gdb-buildbot.osci.io/results/Fedora-x86_64-native-gdbserver-m64/e8/e822f2cda9bc484adb5f8860050640a5c6f1ced9//xfail.table.gz>