[binutils-gdb] Adjust command completion output when TUI is disabled

classic Classic list List threaded Threaded
10 messages Options
Reply | Threaded
Open this post in threaded view
|

[binutils-gdb] Adjust command completion output when TUI is disabled

Sourceware - gdb-testers mailing list
*** TEST RESULTS FOR COMMIT bb8d126033bc7982808323da80ac8649e27bb3eb ***

commit bb8d126033bc7982808323da80ac8649e27bb3eb
Author:     Sandra Loosemore <[hidden email]>
AuthorDate: Tue Jun 23 09:33:31 2020 -0700
Commit:     Sandra Loosemore <[hidden email]>
CommitDate: Tue Jun 23 09:33:31 2020 -0700

    Adjust command completion output when TUI is disabled
   
    The history-scrolling commands "+", "-", "<" and ">" are only known to
    GDB when TUI is enabled.  This means the "complete pipe " command
    produces different output depending on whether TUI is present, which
    in turn caused
   
    FAIL: gdb.base/shell.exp: cmd complete "pipe "
   
    This patch provides different patterns for that test depending on
    whether or not TUI is available.
   
    2020-06-23  Sandra Loosemore  <[hidden email]>
   
            gdb/testsuite/
            * lib/completion-support.exp (test_gdb_completion_offers_commands):
            Adjust for omitted commands when TUI is disabled.

diff --git a/gdb/testsuite/ChangeLog b/gdb/testsuite/ChangeLog
index 18d19470d5..0864d7522a 100644
--- a/gdb/testsuite/ChangeLog
+++ b/gdb/testsuite/ChangeLog
@@ -1,3 +1,8 @@
+2020-06-23  Sandra Loosemore  <[hidden email]>
+
+ * lib/completion-support.exp (test_gdb_completion_offers_commands):
+ Adjust for omitted commands when TUI is disabled.
+
 2020-06-23  Gary Benson <[hidden email]>
     Pedro Alves  <[hidden email]>
 
diff --git a/gdb/testsuite/lib/completion-support.exp b/gdb/testsuite/lib/completion-support.exp
index 18eac827f5..51436cc671 100644
--- a/gdb/testsuite/lib/completion-support.exp
+++ b/gdb/testsuite/lib/completion-support.exp
@@ -555,10 +555,19 @@ proc test_gdb_completion_offers_commands {input_line} {
     # Force showing two commands.
     gdb_test_no_output "set max-completions 2" ""
 
-    test_gdb_complete_multiple $input_line "" "" {
- "!"
- "+"
-    } "" "" 1
+    # TUI adds additional commands to the possible completions, so we
+    # need different patterns depending on whether or not it is enabled.
+    if { [skip_tui_tests] } {
+ test_gdb_complete_multiple $input_line "" "" {
+    "!"
+    "actions"
+ } "" "" 1
+    } else {
+ test_gdb_complete_multiple $input_line "" "" {
+    "!"
+    "+"
+ } "" "" 1
+    }
 
     # Restore.
     gdb_test_no_output "set max-completions $max_completions" ""
Reply | Threaded
Open this post in threaded view
|

Failures on Ubuntu-Aarch64-native-gdbserver-m64, branch master

Sourceware - gdb-testers mailing list
Buildername:
        Ubuntu-Aarch64-native-gdbserver-m64

Worker:
        ubuntu-aarch64

Full Build URL:
        https://gdb-buildbot.osci.io/#builders/19/builds/3187

Author:
        Sandra Loosemore <[hidden email]>

Commit tested:
        bb8d126033bc7982808323da80ac8649e27bb3eb

Subject of commit:
        Adjust command completion output when TUI is disabled

Testsuite logs (gdb.sum, gdb.log and others):
        https://gdb-buildbot.osci.io/results/Ubuntu-Aarch64-native-gdbserver-m64/bb/bb8d126033bc7982808323da80ac8649e27bb3eb/

*** Diff to previous build ***
==============================================
PASS -> KFAIL: gdb.threads/process-dies-while-handling-bp.exp: non_stop=off: cond_bp_target=1: inferior 1 exited
==============================================

*** Complete list of XFAILs for this builder ***

To obtain the list of XFAIL tests for this builder, go to:

        <https://gdb-buildbot.osci.io/results/Ubuntu-Aarch64-native-gdbserver-m64/bb/bb8d126033bc7982808323da80ac8649e27bb3eb//xfail.gz>

You can also see a pretty-printed version of the list, with more information
about each XFAIL, by going to:

        <https://gdb-buildbot.osci.io/results/Ubuntu-Aarch64-native-gdbserver-m64/bb/bb8d126033bc7982808323da80ac8649e27bb3eb//xfail.table.gz>

Reply | Threaded
Open this post in threaded view
|

*** COMPILATION FAILED *** Failures on Fedora-i686, branch master *** BREAKAGE ***

gdb-buildbot-2
In reply to this post by Sourceware - gdb-testers mailing list
Buildername:
        Fedora-i686

Worker:
        fedora-x86-64-4

Full Build URL:
        https://gdb-buildbot.osci.io/#builders/18/builds/3551

Author:
        Sandra Loosemore <[hidden email]>

Commit tested:
        bb8d126033bc7982808323da80ac8649e27bb3eb

Subject of commit:
        Adjust command completion output when TUI is disabled

*** FAILED to build GDB -- compile gdb ***
==============================================

+++ The full log is too big to be posted here.
+++ These are the last 100 lines of it.

  CXX    user-regs.o
  CXX    utils.o
  CXX    v850-tdep.o
  CXX    valarith.o
  CXX    valops.o
  CXX    valprint.o
  CXX    value.o
  CXX    varobj.o
  CXX    vax-nbsd-tdep.o
  CXX    vax-tdep.o
  GEN    stamp-version
  CXX    windows-tdep.o
  CXX    x86-linux-nat.o
  CXX    x86-nat.o
  CXX    x86-tdep.o
  CXX    xcoffread.o
  GEN    xml-builtin.c
  CXX    xml-support.o
  CXX    xml-syscall.o
  CXX    xml-tdesc.o
  CXX    xstormy16-tdep.o
  CXX    xtensa-config.o
  CXX    xtensa-linux-tdep.o
  CXX    xtensa-tdep.o
  CXX    gdb.o
  CXX    aarch32-tdep.o
  CXX    ada-exp.o
  CXX    ada-lang.o
  CXX    ada-tasks.o
  CXX    ada-typeprint.o
  CXX    ada-valprint.o
  CXX    ada-varobj.o
  CXX    addrmap.o
  CXX    agent.o
  CXX    alloc.o
  CXX    annotate.o
  CXX    arc-tdep.o
  CXX    arch-utils.o
  CXX    arch/aarch32.o
  CXX    arch/arc.o
  CXX    arch/arm-get-next-pcs.o
  CXX    arch/arm-linux.o
  CXX    arch/arm.o
  CXX    arch/i386.o
  CXX    arch/ppc-linux-common.o
  CXX    arch/riscv.o
  CXX    arm-bsd-tdep.o
  CXX    arm-fbsd-tdep.o
  CXX    arm-linux-tdep.o
  CXX    arm-nbsd-tdep.o
  CXX    arm-obsd-tdep.o
  CXX    arm-pikeos-tdep.o
  CXX    arm-symbian-tdep.o
  CXX    arm-tdep.o
  CXX    arm-wince-tdep.o
  CXX    async-event.o
  CXX    auto-load.o
  CXX    auxv.o
  CXX    avr-tdep.o
  CXX    ax-gdb.o
  CXX    ax-general.o
  CXX    bcache.o
  CXX    bfd-target.o
  CXX    bfin-linux-tdep.o
  CXX    bfin-tdep.o
  CXX    block.o
  CXX    blockframe.o
  CXX    break-catch-sig.o
  CXX    break-catch-syscall.o
  CXX    break-catch-throw.o
  CXX    breakpoint.o
  CXX    bsd-uthread.o
  CXX    btrace.o
  CXX    build-id.o
  CXX    buildsym-legacy.o
  CXX    buildsym.o
  CXX    c-exp.o
  CXX    cp-name-parser.o
  CXX    d-exp.o
  CXX    f-exp.o
  CXX    go-exp.o
  CXX    m2-exp.o
  CXX    p-exp.o
  CXX    rust-exp.o
  CXX    version.o
  CXX    xml-builtin.o
  GEN    init.c
  CXX    init.o
  CXXLD  gdb
/usr/bin/ld: ../opcodes/libopcodes.a(riscv-dis.o): in function `parse_riscv_dis_option':
/home/gdb-buildbot-2/fedora-x86-64-4/fedora-i686/build/opcodes/../../binutils-gdb/opcodes/riscv-dis.c:102: undefined reference to `riscv_get_priv_spec_class'
collect2: error: ld returned 1 exit status
make[2]: *** [Makefile:1861: gdb] Error 1
make[2]: Leaving directory '/home/gdb-buildbot-2/fedora-x86-64-4/fedora-i686/build/gdb'
make[1]: *** [Makefile:10066: all-gdb] Error 2
make[1]: Leaving directory '/home/gdb-buildbot-2/fedora-x86-64-4/fedora-i686/build'
make: *** [Makefile:854: all] Error 2
program finished with exit code 2
elapsedTime=464.116214
==============================================

Reply | Threaded
Open this post in threaded view
|

Failures on Fedora-x86_64-cc-with-index, branch master

gdb-buildbot-2
In reply to this post by Sourceware - gdb-testers mailing list
Buildername:
        Fedora-x86_64-cc-with-index

Worker:
        fedora-x86-64-4

Full Build URL:
        https://gdb-buildbot.osci.io/#builders/20/builds/3499

Author:
        Sandra Loosemore <[hidden email]>

Commit tested:
        bb8d126033bc7982808323da80ac8649e27bb3eb

Subject of commit:
        Adjust command completion output when TUI is disabled

Testsuite logs (gdb.sum, gdb.log and others):
        https://gdb-buildbot.osci.io/results/Fedora-x86_64-cc-with-index/bb/bb8d126033bc7982808323da80ac8649e27bb3eb/

*** Diff to previous build ***
==============================================
PASS -> KFAIL: gdb.threads/omp-par-scope.exp: multi_scope: first thread: print i02
PASS -> KFAIL: gdb.threads/omp-par-scope.exp: multi_scope: first thread: print i12
PASS -> KFAIL: gdb.threads/omp-par-scope.exp: multi_scope: first thread: print i22
PASS -> KFAIL: gdb.threads/omp-par-scope.exp: nested_func: 1st call: 1st thread: print k
PASS -> KFAIL: gdb.threads/omp-par-scope.exp: nested_func: 1st call: 1st thread: print r
PASS -> KFAIL: gdb.threads/omp-par-scope.exp: nested_func: 1st call: 1st thread: print z
PASS -> KFAIL: gdb.threads/omp-par-scope.exp: nested_parallel: inner_threads: 3rd stop: print i
PASS -> KFAIL: gdb.threads/omp-par-scope.exp: nested_parallel: inner_threads: 3rd stop: print j
PASS -> KFAIL: gdb.threads/process-dies-while-handling-bp.exp: non_stop=off: cond_bp_target=0: inferior 1 exited
PASS -> KFAIL: gdb.threads/process-dies-while-handling-bp.exp: non_stop=on: cond_bp_target=0: inferior 1 exited
==============================================

*** Complete list of XFAILs for this builder ***

To obtain the list of XFAIL tests for this builder, go to:

        <https://gdb-buildbot.osci.io/results/Fedora-x86_64-cc-with-index/bb/bb8d126033bc7982808323da80ac8649e27bb3eb//xfail.gz>

You can also see a pretty-printed version of the list, with more information
about each XFAIL, by going to:

        <https://gdb-buildbot.osci.io/results/Fedora-x86_64-cc-with-index/bb/bb8d126033bc7982808323da80ac8649e27bb3eb//xfail.table.gz>

Reply | Threaded
Open this post in threaded view
|

Failures on Fedora-x86_64-m32, branch master

gdb-buildbot-2
In reply to this post by Sourceware - gdb-testers mailing list
Buildername:
        Fedora-x86_64-m32

Worker:
        fedora-x86-64-3

Full Build URL:
        https://gdb-buildbot.osci.io/#builders/17/builds/3545

Author:
        Sandra Loosemore <[hidden email]>

Commit tested:
        bb8d126033bc7982808323da80ac8649e27bb3eb

Subject of commit:
        Adjust command completion output when TUI is disabled

Testsuite logs (gdb.sum, gdb.log and others):
        https://gdb-buildbot.osci.io/results/Fedora-x86_64-m32/bb/bb8d126033bc7982808323da80ac8649e27bb3eb/

*** Diff to previous build ***
==============================================
new FAIL: gdb.base/coredump-filter.exp: disassembling function main for non-Private-Anonymous: no binary: loading /home/gdb-buildbot/fedora-x86-64-3/fedora-x86-64-m32/build/gdb/testsuite/outputs/gdb.base/coredump-filter/non-private-anon.gcore
new FAIL: gdb.base/coredump-filter.exp: loading and testing corefile for non-Shared-Anonymous: loading /home/gdb-buildbot/fedora-x86-64-3/fedora-x86-64-m32/build/gdb/testsuite/outputs/gdb.base/coredump-filter/non-shared-anon.gcore
PASS -> KFAIL: gdb.threads/non-ldr-exit.exp: program exits normally
==============================================

*** Complete list of XFAILs for this builder ***

To obtain the list of XFAIL tests for this builder, go to:

        <https://gdb-buildbot.osci.io/results/Fedora-x86_64-m32/bb/bb8d126033bc7982808323da80ac8649e27bb3eb//xfail.gz>

You can also see a pretty-printed version of the list, with more information
about each XFAIL, by going to:

        <https://gdb-buildbot.osci.io/results/Fedora-x86_64-m32/bb/bb8d126033bc7982808323da80ac8649e27bb3eb//xfail.table.gz>

Reply | Threaded
Open this post in threaded view
|

Failures on Fedora-x86_64-m64, branch master

gdb-buildbot-2
In reply to this post by Sourceware - gdb-testers mailing list
Buildername:
        Fedora-x86_64-m64

Worker:
        fedora-x86-64-4

Full Build URL:
        https://gdb-buildbot.osci.io/#builders/3/builds/3608

Author:
        Sandra Loosemore <[hidden email]>

Commit tested:
        bb8d126033bc7982808323da80ac8649e27bb3eb

Subject of commit:
        Adjust command completion output when TUI is disabled

Testsuite logs (gdb.sum, gdb.log and others):
        https://gdb-buildbot.osci.io/results/Fedora-x86_64-m64/bb/bb8d126033bc7982808323da80ac8649e27bb3eb/

*** Diff to previous build ***
==============================================
PASS -> KFAIL: gdb.threads/non-ldr-exit.exp: program exits normally
PASS -> KFAIL: gdb.threads/omp-par-scope.exp: nested_func: 2nd call: 1st thread: print k
PASS -> KFAIL: gdb.threads/omp-par-scope.exp: nested_func: 2nd call: 1st thread: print r
PASS -> KFAIL: gdb.threads/omp-par-scope.exp: nested_func: 2nd call: 1st thread: print z
PASS -> KFAIL: gdb.threads/omp-par-scope.exp: nested_parallel: inner_threads: 1st stop: print i
PASS -> KFAIL: gdb.threads/omp-par-scope.exp: nested_parallel: inner_threads: 1st stop: print j
PASS -> KFAIL: gdb.threads/omp-par-scope.exp: single_scope: second thread: print i3
PASS -> KFAIL: gdb.threads/process-dies-while-handling-bp.exp: non_stop=on: cond_bp_target=0: inferior 1 exited
PASS -> KFAIL: gdb.threads/process-dies-while-handling-bp.exp: non_stop=on: cond_bp_target=1: inferior 1 exited
==============================================

*** Complete list of XFAILs for this builder ***

To obtain the list of XFAIL tests for this builder, go to:

        <https://gdb-buildbot.osci.io/results/Fedora-x86_64-m64/bb/bb8d126033bc7982808323da80ac8649e27bb3eb//xfail.gz>

You can also see a pretty-printed version of the list, with more information
about each XFAIL, by going to:

        <https://gdb-buildbot.osci.io/results/Fedora-x86_64-m64/bb/bb8d126033bc7982808323da80ac8649e27bb3eb//xfail.table.gz>

Reply | Threaded
Open this post in threaded view
|

Failures on Fedora-x86_64-native-extended-gdbserver-m32, branch master

gdb-buildbot-2
In reply to this post by Sourceware - gdb-testers mailing list
Buildername:
        Fedora-x86_64-native-extended-gdbserver-m32

Worker:
        fedora-x86-64-3

Full Build URL:
        https://gdb-buildbot.osci.io/#builders/4/builds/3441

Author:
        Sandra Loosemore <[hidden email]>

Commit tested:
        bb8d126033bc7982808323da80ac8649e27bb3eb

Subject of commit:
        Adjust command completion output when TUI is disabled

Testsuite logs (gdb.sum, gdb.log and others):
        https://gdb-buildbot.osci.io/results/Fedora-x86_64-native-extended-gdbserver-m32/bb/bb8d126033bc7982808323da80ac8649e27bb3eb/

*** Diff to previous build ***
==============================================
PASS -> FAIL: gdb.base/options.exp: test-print: cmd complete "thread apply all print "
PASS -> FAIL: gdb.base/options.exp: test-print: tab complete "thread apply all print "
PASS -> FAIL: gdb.fortran/vla-ptype.exp: ptype vla1
PASS -> FAIL: gdb.fortran/vla-value.exp: print member in non-allocated vla1
PASS -> FAIL: gdb.fortran/vla-value.exp: set member in non-allocated vla1
new FAIL: gdb.multi/multi-re-run.exp: re_run_inf=2: iter=2: continue until exit
new FAIL: gdb.multi/multi-re-run.exp: re_run_inf=2: iter=2: print re_run_var_2
PASS -> FAIL: gdb.threads/fork-plus-threads.exp: detach-on-fork=off: inferior 1 exited
PASS -> FAIL: gdb.threads/fork-plus-threads.exp: detach-on-fork=off: only inferior 1 left
PASS -> KFAIL: gdb.threads/process-dies-while-handling-bp.exp: non_stop=off: cond_bp_target=0: inferior 1 exited
new KFAIL: gdb.threads/watchthreads2.exp: gdb can drop watchpoints in multithreaded app
==============================================

*** Complete list of XFAILs for this builder ***

To obtain the list of XFAIL tests for this builder, go to:

        <https://gdb-buildbot.osci.io/results/Fedora-x86_64-native-extended-gdbserver-m32/bb/bb8d126033bc7982808323da80ac8649e27bb3eb//xfail.gz>

You can also see a pretty-printed version of the list, with more information
about each XFAIL, by going to:

        <https://gdb-buildbot.osci.io/results/Fedora-x86_64-native-extended-gdbserver-m32/bb/bb8d126033bc7982808323da80ac8649e27bb3eb//xfail.table.gz>

Reply | Threaded
Open this post in threaded view
|

Failures on Fedora-x86_64-native-extended-gdbserver-m64, branch master

gdb-buildbot-2
In reply to this post by Sourceware - gdb-testers mailing list
Buildername:
        Fedora-x86_64-native-extended-gdbserver-m64

Worker:
        fedora-x86-64-4

Full Build URL:
        https://gdb-buildbot.osci.io/#builders/2/builds/3442

Author:
        Sandra Loosemore <[hidden email]>

Commit tested:
        bb8d126033bc7982808323da80ac8649e27bb3eb

Subject of commit:
        Adjust command completion output when TUI is disabled

Testsuite logs (gdb.sum, gdb.log and others):
        https://gdb-buildbot.osci.io/results/Fedora-x86_64-native-extended-gdbserver-m64/bb/bb8d126033bc7982808323da80ac8649e27bb3eb/

*** Diff to previous build ***
==============================================
PASS -> FAIL: gdb.threads/interrupted-hand-call.exp: continue until exit
PASS -> KFAIL: gdb.threads/omp-par-scope.exp: multi_scope: first thread: print i02
PASS -> KFAIL: gdb.threads/omp-par-scope.exp: multi_scope: first thread: print i12
PASS -> KFAIL: gdb.threads/omp-par-scope.exp: multi_scope: first thread: print i22
PASS -> KFAIL: gdb.threads/omp-par-scope.exp: nested_func: 1st call: 1st thread: print k
PASS -> KFAIL: gdb.threads/omp-par-scope.exp: nested_func: 1st call: 1st thread: print r
PASS -> KFAIL: gdb.threads/omp-par-scope.exp: nested_func: 1st call: 1st thread: print z
PASS -> KFAIL: gdb.threads/omp-par-scope.exp: nested_func: 2nd call: 1st thread: print k
PASS -> KFAIL: gdb.threads/omp-par-scope.exp: nested_func: 2nd call: 1st thread: print r
PASS -> KFAIL: gdb.threads/omp-par-scope.exp: nested_func: 2nd call: 1st thread: print z
PASS -> KFAIL: gdb.threads/omp-par-scope.exp: nested_parallel: outer_threads: outer stop: print i
PASS -> KFAIL: gdb.threads/omp-par-scope.exp: nested_parallel: outer_threads: outer stop: print j
PASS -> KFAIL: gdb.threads/process-dies-while-handling-bp.exp: non_stop=off: cond_bp_target=0: inferior 1 exited
==============================================

*** Complete list of XFAILs for this builder ***

To obtain the list of XFAIL tests for this builder, go to:

        <https://gdb-buildbot.osci.io/results/Fedora-x86_64-native-extended-gdbserver-m64/bb/bb8d126033bc7982808323da80ac8649e27bb3eb//xfail.gz>

You can also see a pretty-printed version of the list, with more information
about each XFAIL, by going to:

        <https://gdb-buildbot.osci.io/results/Fedora-x86_64-native-extended-gdbserver-m64/bb/bb8d126033bc7982808323da80ac8649e27bb3eb//xfail.table.gz>

Reply | Threaded
Open this post in threaded view
|

Failures on Fedora-x86_64-native-gdbserver-m32, branch master

gdb-buildbot-2
In reply to this post by Sourceware - gdb-testers mailing list
Buildername:
        Fedora-x86_64-native-gdbserver-m32

Worker:
        fedora-x86-64-3

Full Build URL:
        https://gdb-buildbot.osci.io/#builders/24/builds/3454

Author:
        Sandra Loosemore <[hidden email]>

Commit tested:
        bb8d126033bc7982808323da80ac8649e27bb3eb

Subject of commit:
        Adjust command completion output when TUI is disabled

Testsuite logs (gdb.sum, gdb.log and others):
        https://gdb-buildbot.osci.io/results/Fedora-x86_64-native-gdbserver-m32/bb/bb8d126033bc7982808323da80ac8649e27bb3eb/

*** Diff to previous build ***
==============================================
PASS -> KFAIL: gdb.threads/process-dies-while-handling-bp.exp: non_stop=off: cond_bp_target=0: inferior 1 exited
==============================================

*** Complete list of XFAILs for this builder ***

To obtain the list of XFAIL tests for this builder, go to:

        <https://gdb-buildbot.osci.io/results/Fedora-x86_64-native-gdbserver-m32/bb/bb8d126033bc7982808323da80ac8649e27bb3eb//xfail.gz>

You can also see a pretty-printed version of the list, with more information
about each XFAIL, by going to:

        <https://gdb-buildbot.osci.io/results/Fedora-x86_64-native-gdbserver-m32/bb/bb8d126033bc7982808323da80ac8649e27bb3eb//xfail.table.gz>

Reply | Threaded
Open this post in threaded view
|

Failures on Fedora-x86_64-native-gdbserver-m64, branch master

gdb-buildbot-2
In reply to this post by Sourceware - gdb-testers mailing list
Buildername:
        Fedora-x86_64-native-gdbserver-m64

Worker:
        fedora-x86-64-4

Full Build URL:
        https://gdb-buildbot.osci.io/#builders/22/builds/3453

Author:
        Sandra Loosemore <[hidden email]>

Commit tested:
        bb8d126033bc7982808323da80ac8649e27bb3eb

Subject of commit:
        Adjust command completion output when TUI is disabled

Testsuite logs (gdb.sum, gdb.log and others):
        https://gdb-buildbot.osci.io/results/Fedora-x86_64-native-gdbserver-m64/bb/bb8d126033bc7982808323da80ac8649e27bb3eb/

*** Diff to previous build ***
==============================================
PASS -> FAIL: gdb.multi/multi-re-run.exp: re_run_inf=1: iter=1: continue until exit
PASS -> FAIL: gdb.multi/multi-re-run.exp: re_run_inf=1: iter=1: print re_run_var_1
new UNRESOLVED: gdb.multi/multi-re-run.exp: re_run_inf=1: iter=2: delete all breakpoints in delete_breakpoints
PASS -> UNRESOLVED: gdb.multi/multi-re-run.exp: re_run_inf=1: iter=2: setting breakpoint at all_started
PASS -> KFAIL: gdb.threads/omp-par-scope.exp: nested_parallel: inner_threads: 1st stop: print i
PASS -> KFAIL: gdb.threads/omp-par-scope.exp: nested_parallel: inner_threads: 1st stop: print j
PASS -> KFAIL: gdb.threads/omp-par-scope.exp: nested_parallel: outer_threads: outer stop: print i
PASS -> KFAIL: gdb.threads/omp-par-scope.exp: nested_parallel: outer_threads: outer stop: print j
PASS -> KFAIL: gdb.threads/process-dies-while-handling-bp.exp: non_stop=off: cond_bp_target=0: inferior 1 exited
PASS -> FAIL: gdb.threads/thread-unwindonsignal.exp: continue until exit
PASS -> FAIL: gdb.trace/mi-tsv-changed.exp: create delete modify: tvariable $tvar3 modified
==============================================

*** Complete list of XFAILs for this builder ***

To obtain the list of XFAIL tests for this builder, go to:

        <https://gdb-buildbot.osci.io/results/Fedora-x86_64-native-gdbserver-m64/bb/bb8d126033bc7982808323da80ac8649e27bb3eb//xfail.gz>

You can also see a pretty-printed version of the list, with more information
about each XFAIL, by going to:

        <https://gdb-buildbot.osci.io/results/Fedora-x86_64-native-gdbserver-m64/bb/bb8d126033bc7982808323da80ac8649e27bb3eb//xfail.table.gz>