Oh dear. I regret to inform you that commit 098f9ed48e1c94a2624c825ba93d72b163d41196 might be unfortunate

classic Classic list List threaded Threaded
12 messages Options
Reply | Threaded
Open this post in threaded view
|

Oh dear. I regret to inform you that commit 098f9ed48e1c94a2624c825ba93d72b163d41196 might be unfortunate

gdb-buildbot
My lords, ladies, gentlemen, members of the public.

It is a matter of great regret and sadness to inform you that commit:

        Always create an execution info window for a source window
        098f9ed48e1c94a2624c825ba93d72b163d41196

might have made GDB unwell.  Since I am just your Butler BuildBot,
I kindly ask that a human superior officer double-check this.

Please note that if you are reading this message on gdb-patches, there might
be other builders broken.

You can find more details about the unfortunate breakage in the next messages.

Cheers,

Your GDB BuildBot.
Reply | Threaded
Open this post in threaded view
|

Breakage on builder Solaris11-sparcv9-m64, revision 098f9ed48e1c94a2624c825ba93d72b163d41196

gdb-buildbot
Unfortunately it seems that there is a breakage on GDB.

Commit title: 'Always create an execution info window for a source window'
Revision: 098f9ed48e1c94a2624c825ba93d72b163d41196

You can find more details below:

+-+-+-+-+-+-+-+-+-+-+-+-+-+-+-+-+-+-+-+


+++ The full log is too big to be posted here.
+++ These are the last 100 lines of it.

  CXX    ravenscar-thread.o
  CXX    record-btrace.o
  CXX    record-full.o
  CXX    record.o
  CXX    regcache-dump.o
In file included from ../../binutils-gdb/gdb/exceptions.h:23:0,
                 from ../../binutils-gdb/gdb/utils.h:24,
                 from ../../binutils-gdb/gdb/defs.h:652,
                 from ../../binutils-gdb/gdb/record-btrace.c:22:
../../binutils-gdb/gdb/ui-out.h: In function void btrace_insn_history(ui_out*, const btrace_thread_info*, const btrace_insn_iterator*, const btrace_insn_iterator*, gdb_disassembly_flags):
../../binutils-gdb/gdb/ui-out.h:219:18: warning: asm_list.ui_out_emit_type<(ui_out_type)1>::m_uiout may be used uninitialized in this function [-Wmaybe-uninitialized]
     m_uiout->end (Type);
     ~~~~~~~~~~~~~^~~~~~
../../binutils-gdb/gdb/record-btrace.c:779:35: note: asm_list.ui_out_emit_type<(ui_out_type)1>::m_uiout was declared here
   gdb::optional<ui_out_emit_list> asm_list;
                                   ^~~~~~~~
  CXX    regcache.o
  CXX    reggroups.o
  CXX    registry.o
  CXX    remote-fileio.o
  CXX    remote-notif.o
  CXX    remote.o
  CXX    reverse.o
  CXX    rust-exp.o
  CXX    rust-lang.o
  CXX    selftest-arch.o
  CXX    sentinel-frame.o
  CXX    ser-base.o
  CXX    ser-event.o
  CXX    ser-pipe.o
  CXX    ser-tcp.o
  CXX    ser-uds.o
  CXX    ser-unix.o
  CXX    serial.o
  CXX    skip.o
  CXX    sol-thread.o
  CXX    sol2-tdep.o
  CXX    solib-svr4.o
  CXX    solib-target.o
  CXX    solib.o
  CXX    source-cache.o
  CXX    source.o
  CXX    sparc-ravenscar-thread.o
  CXX    sparc-sol2-nat.o
  CXX    sparc-sol2-tdep.o
  CXX    sparc-tdep.o
  CXX    sparc64-sol2-tdep.o
  CXX    sparc64-tdep.o
  CXX    stabsread.o
  CXX    stack.o
  CXX    stap-probe.o
  CXX    std-regs.o
  CXX    symfile-debug.o
  CXX    symfile.o
  CXX    symmisc.o
  CXX    symtab.o
  CXX    target-dcache.o
  CXX    target-descriptions.o
  CXX    target-float.o
  CXX    target-memory.o
  CXX    target.o
  CXX    target/waitstatus.o
  CXX    test-target.o
  CXX    thread-iter.o
  CXX    thread.o
  CXX    tid-parse.o
  CXX    top.o
  CXX    tracefile-tfile.o
  CXX    tracefile.o
  CXX    tracepoint.o
  CXX    trad-frame.o
  CXX    tramp-frame.o
  CXX    tui/tui-command.o
  CXX    tui/tui-data.o
  CXX    tui/tui-disasm.o
  CXX    tui/tui-file.o
  CXX    tui/tui-hooks.o
  CXX    tui/tui-interp.o
  CXX    tui/tui-io.o
  CXX    tui/tui-layout.o
  CXX    tui/tui-out.o
../../binutils-gdb/gdb/tui/tui-layout.c: In function void show_data(tui_layout_type):
../../binutils-gdb/gdb/tui/tui-layout.c:682:72: error: no matching function for call to tui_win_info::reset(int&, int, int, int)
     tui_win_list[DATA_WIN]->reset (data_height, tui_term_width (), 0, 0);
                                                                        ^
In file included from ../../binutils-gdb/gdb/tui/tui-layout.c:31:0:
../../binutils-gdb/gdb/tui/tui-data.h:64:16: note: candidate: virtual void tui_gen_win_info::reset(tui_win_type, int, int, int, int)
   virtual void reset (enum tui_win_type win_type,
                ^~~~~
../../binutils-gdb/gdb/tui/tui-data.h:64:16: note:   candidate expects 5 arguments, 4 provided
  CXX    tui/tui-regs.o
gmake[2]: *** [Makefile:1632: tui/tui-layout.o] Error 1
gmake[2]: *** Waiting for unfinished jobs....
gmake[2]: Leaving directory '/opt/gdb-buildbot/home/solaris11-sparcv9/solaris11-sparcv9-m64/build/gdb'
gmake[1]: *** [Makefile:9229: all-gdb] Error 2
gmake[1]: Leaving directory '/opt/gdb-buildbot/home/solaris11-sparcv9/solaris11-sparcv9-m64/build'
gmake: *** [Makefile:851: all] Error 2
program finished with exit code 2
elapsedTime=424.235841
Reply | Threaded
Open this post in threaded view
|

Breakage on builder Solaris11-amd64-m64, revision 098f9ed48e1c94a2624c825ba93d72b163d41196

gdb-buildbot
In reply to this post by gdb-buildbot
Unfortunately it seems that there is a breakage on GDB.

Commit title: 'Always create an execution info window for a source window'
Revision: 098f9ed48e1c94a2624c825ba93d72b163d41196

You can find more details below:

+-+-+-+-+-+-+-+-+-+-+-+-+-+-+-+-+-+-+-+


+++ The full log is too big to be posted here.
+++ These are the last 100 lines of it.

  CXX    python/py-type.o
  CXX    python/py-unwind.o
  CXX    python/py-utils.o
  CXX    python/py-value.o
  CXX    python/py-varobj.o
  CXX    python/py-xmethods.o
  CXX    python/python.o
  CXX    record-btrace.o
  CXX    record-full.o
  CXX    record.o
  CXX    regcache-dump.o
In file included from ../../binutils-gdb/gdb/exceptions.h:23:0,
                 from ../../binutils-gdb/gdb/utils.h:24,
                 from ../../binutils-gdb/gdb/defs.h:652,
                 from ../../binutils-gdb/gdb/record-btrace.c:22:
../../binutils-gdb/gdb/ui-out.h: In function void btrace_insn_history(ui_out*, const btrace_thread_info*, const btrace_insn_iterator*, const btrace_insn_iterator*, gdb_disassembly_flags):
../../binutils-gdb/gdb/ui-out.h:219:18: warning: asm_list.ui_out_emit_type<(ui_out_type)1>::m_uiout may be used uninitialized in this function [-Wmaybe-uninitialized]
     m_uiout->end (Type);
     ~~~~~~~~~~~~~^~~~~~
../../binutils-gdb/gdb/record-btrace.c:779:35: note: asm_list.ui_out_emit_type<(ui_out_type)1>::m_uiout was declared here
   gdb::optional<ui_out_emit_list> asm_list;
                                   ^~~~~~~~
  CXX    regcache.o
  CXX    reggroups.o
  CXX    registry.o
  CXX    remote-fileio.o
  CXX    remote-notif.o
  CXX    remote.o
  CXX    reverse.o
  CXX    rust-exp.o
  CXX    rust-lang.o
  CXX    selftest-arch.o
  CXX    sentinel-frame.o
  CXX    ser-base.o
  CXX    ser-event.o
  CXX    ser-pipe.o
  CXX    ser-tcp.o
  CXX    ser-uds.o
  CXX    ser-unix.o
  CXX    serial.o
  CXX    skip.o
  CXX    sol-thread.o
  CXX    sol2-tdep.o
  CXX    solib-svr4.o
  CXX    solib-target.o
  CXX    solib.o
  CXX    source-cache.o
  CXX    source.o
  CXX    stabsread.o
  CXX    stack.o
  CXX    stap-probe.o
  CXX    std-regs.o
  CXX    symfile-debug.o
  CXX    symfile.o
  CXX    symmisc.o
  CXX    symtab.o
  CXX    target-dcache.o
  CXX    target-descriptions.o
  CXX    target-float.o
  CXX    target-memory.o
  CXX    target.o
  CXX    target/waitstatus.o
  CXX    test-target.o
  CXX    thread-iter.o
  CXX    thread.o
  CXX    tid-parse.o
  CXX    top.o
  CXX    tracefile-tfile.o
  CXX    tracefile.o
  CXX    tracepoint.o
  CXX    trad-frame.o
  CXX    tramp-frame.o
  CXX    tui/tui-command.o
  CXX    tui/tui-data.o
  CXX    tui/tui-disasm.o
  CXX    tui/tui-file.o
  CXX    tui/tui-hooks.o
  CXX    tui/tui-interp.o
  CXX    tui/tui-io.o
  CXX    tui/tui-layout.o
  CXX    tui/tui-out.o
../../binutils-gdb/gdb/tui/tui-layout.c: In function void show_data(tui_layout_type):
../../binutils-gdb/gdb/tui/tui-layout.c:682:72: error: no matching function for call to tui_win_info::reset(int&, int, int, int)
     tui_win_list[DATA_WIN]->reset (data_height, tui_term_width (), 0, 0);
                                                                        ^
In file included from ../../binutils-gdb/gdb/tui/tui-layout.c:31:0:
../../binutils-gdb/gdb/tui/tui-data.h:64:16: note: candidate: virtual void tui_gen_win_info::reset(tui_win_type, int, int, int, int)
   virtual void reset (enum tui_win_type win_type,
                ^~~~~
../../binutils-gdb/gdb/tui/tui-data.h:64:16: note:   candidate expects 5 arguments, 4 provided
  CXX    tui/tui-regs.o
gmake[2]: *** [Makefile:1632: tui/tui-layout.o] Error 1
gmake[2]: *** Waiting for unfinished jobs....
gmake[2]: Leaving directory '/opt/gdb-buildbot/home/solaris11-amd64/solaris11-amd64-m64/build/gdb'
gmake[1]: *** [Makefile:9229: all-gdb] Error 2
gmake[1]: Leaving directory '/opt/gdb-buildbot/home/solaris11-amd64/solaris11-amd64-m64/build'
gmake: *** [Makefile:851: all] Error 2
program finished with exit code 2
elapsedTime=529.858305
Reply | Threaded
Open this post in threaded view
|

Breakage on builder NetBSD-x86_64-m64, revision 098f9ed48e1c94a2624c825ba93d72b163d41196

gdb-buildbot
In reply to this post by gdb-buildbot
Unfortunately it seems that there is a breakage on GDB.

Commit title: 'Always create an execution info window for a source window'
Revision: 098f9ed48e1c94a2624c825ba93d72b163d41196

You can find more details below:

+-+-+-+-+-+-+-+-+-+-+-+-+-+-+-+-+-+-+-+


+++ The full log is too big to be posted here.
+++ These are the last 100 lines of it.

  CXX    opencl-lang.o
  CXX    osabi.o
  CXX    osdata.o
  YACC   p-exp.c
  CXX    p-exp.o
  CXX    p-lang.o
  CXX    p-typeprint.o
  CXX    p-valprint.o
  CXX    parse.o
  CXX    posix-hdep.o
  CXX    printcmd.o
  CXX    probe.o
  CXX    process-stratum-target.o
  CXX    producer.o
  CXX    progspace-and-thread.o
  CXX    progspace.o
  CXX    prologue-value.o
  CXX    psymtab.o
  CXX    python/python.o
  CXX    record-btrace.o
  CXX    record-full.o
  CXX    record.o
  CXX    regcache-dump.o
  CXX    regcache.o
  CXX    reggroups.o
  CXX    registry.o
  CXX    remote-fileio.o
  CXX    remote-notif.o
  CXX    remote.o
  CXX    reverse.o
  YACC   rust-exp.c
  CXX    rust-exp.o
  CXX    rust-lang.o
  CXX    selftest-arch.o
  CXX    sentinel-frame.o
  CXX    ser-base.o
  CXX    ser-event.o
  CXX    ser-pipe.o
  CXX    ser-tcp.o
  CXX    ser-uds.o
  CXX    ser-unix.o
  CXX    serial.o
  CXX    skip.o
  CXX    solib-svr4.o
  CXX    solib-target.o
  CXX    solib.o
  CXX    source-cache.o
  CXX    source.o
  CXX    stabsread.o
  CXX    stack.o
  CXX    stap-probe.o
  CXX    std-regs.o
  CXX    symfile-debug.o
  CXX    symfile.o
  CXX    symmisc.o
  CXX    symtab.o
  CXX    target-dcache.o
  CXX    target-descriptions.o
  CXX    target-float.o
  CXX    target-memory.o
  CXX    target.o
  CXX    target/waitstatus.o
  CXX    test-target.o
  CXX    thread-iter.o
  CXX    thread.o
  CXX    tid-parse.o
  CXX    top.o
  CXX    tracefile-tfile.o
  CXX    tracefile.o
  CXX    tracepoint.o
  CXX    trad-frame.o
  CXX    tramp-frame.o
  CXX    tui/tui-command.o
  CXX    tui/tui-data.o
  CXX    tui/tui-disasm.o
  CXX    tui/tui-file.o
  CXX    tui/tui-hooks.o
  CXX    tui/tui-interp.o
  CXX    tui/tui-io.o
  CXX    tui/tui-layout.o
../../binutils-gdb/gdb/tui/tui-layout.c: In function 'void show_data(tui_layout_type)':
../../binutils-gdb/gdb/tui/tui-layout.c:682:72: error: no matching function for call to 'tui_win_info::reset(int&, int, int, int)'
     tui_win_list[DATA_WIN]->reset (data_height, tui_term_width (), 0, 0);
                                                                        ^
In file included from ../../binutils-gdb/gdb/tui/tui-layout.c:31:0:
../../binutils-gdb/gdb/tui/tui-data.h:64:16: note: candidate: virtual void tui_gen_win_info::reset(tui_win_type, int, int, int, int)
   virtual void reset (enum tui_win_type win_type,
                ^
../../binutils-gdb/gdb/tui/tui-data.h:64:16: note:   candidate expects 5 arguments, 4 provided
Makefile:1630: recipe for target 'tui/tui-layout.o' failed
gmake[2]: *** [tui/tui-layout.o] Error 1
gmake[2]: Leaving directory '/data/motusgdb/gdbosci/netbsd-x86_64/build/gdb'
Makefile:9228: recipe for target 'all-gdb' failed
gmake[1]: *** [all-gdb] Error 2
gmake[1]: Leaving directory '/data/motusgdb/gdbosci/netbsd-x86_64/build'
Makefile:850: recipe for target 'all' failed
gmake: *** [all] Error 2
program finished with exit code 2
elapsedTime=686.546540
Reply | Threaded
Open this post in threaded view
|

Re: Breakage on builder Solaris11-sparcv9-m64, revision 098f9ed48e1c94a2624c825ba93d72b163d41196

Tom Tromey-2
In reply to this post by gdb-buildbot
>>>>> ">" == gdb-buildbot  <[hidden email]> writes:

>>   CXX    tui/tui-out.o
>> ../../binutils-gdb/gdb/tui/tui-layout.c: In function void show_data(tui_layout_type):
>> ../../binutils-gdb/gdb/tui/tui-layout.c:682:72: error: no matching function for call to tui_win_info::reset(int&, int, int, int)
>>      tui_win_list[DATA_WIN]->reset (data_height, tui_term_width (), 0, 0);
>>                                                                         ^
>> In file included from ../../binutils-gdb/gdb/tui/tui-layout.c:31:0:
>> ../../binutils-gdb/gdb/tui/tui-data.h:64:16: note: candidate: virtual void tui_gen_win_info::reset(tui_win_type, int, int, int, int)
>>    virtual void reset (enum tui_win_type win_type,
>>                 ^~~~~
>> ../../binutils-gdb/gdb/tui/tui-data.h:64:16: note:   candidate expects 5 arguments, 4 provided


Sorry about that.  I didn't rebuild every patch in the series during all
the rebasing and whatnot.  I'll make sure to do that with the next
series.

Tom
Reply | Threaded
Open this post in threaded view
|

Breakage on builder Fedora-x86_64-cc-with-index, revision 098f9ed48e1c94a2624c825ba93d72b163d41196

gdb-buildbot
In reply to this post by gdb-buildbot
Unfortunately it seems that there is a breakage on GDB.

Commit title: 'Always create an execution info window for a source window'
Revision: 098f9ed48e1c94a2624c825ba93d72b163d41196

You can find more details below:

+-+-+-+-+-+-+-+-+-+-+-+-+-+-+-+-+-+-+-+


+++ The full log is too big to be posted here.
+++ These are the last 100 lines of it.

  CXX    s12z-tdep.o
  CXX    s390-linux-tdep.o
  CXX    s390-tdep.o
  CXX    score-tdep.o
  CXX    selftest-arch.o
  CXX    sentinel-frame.o
  CXX    ser-base.o
  CXX    ser-event.o
  CXX    ser-pipe.o
  CXX    ser-tcp.o
  CXX    ser-uds.o
  CXX    ser-unix.o
  CXX    serial.o
  CXX    sh-linux-tdep.o
  CXX    sh-nbsd-tdep.o
  CXX    sh-tdep.o
  CXX    skip.o
  CXX    sol2-tdep.o
  CXX    solib-aix.o
  CXX    solib-darwin.o
  CXX    solib-dsbt.o
  CXX    solib-frv.o
  CXX    solib-spu.o
  CXX    solib-svr4.o
  CXX    solib-target.o
  CXX    solib.o
  CXX    source-cache.o
  CXX    source.o
  CXX    sparc-linux-tdep.o
  CXX    sparc-nbsd-tdep.o
  CXX    sparc-obsd-tdep.o
  CXX    sparc-ravenscar-thread.o
  CXX    sparc-sol2-tdep.o
  CXX    sparc-tdep.o
  CXX    sparc64-fbsd-tdep.o
  CXX    sparc64-linux-tdep.o
  CXX    sparc64-nbsd-tdep.o
  CXX    sparc64-obsd-tdep.o
  CXX    sparc64-sol2-tdep.o
  CXX    sparc64-tdep.o
  CXX    spu-multiarch.o
  CXX    spu-tdep.o
  CXX    stabsread.o
  CXX    stack.o
  CXX    stap-probe.o
  CXX    std-regs.o
  CXX    symfile-debug.o
  CXX    symfile-mem.o
  CXX    symfile.o
  CXX    symmisc.o
  CXX    symtab.o
  CXX    target-dcache.o
  CXX    target-descriptions.o
  CXX    target-float.o
  CXX    target-memory.o
  CXX    target.o
  CXX    target/waitstatus.o
  CXX    test-target.o
  CXX    thread-iter.o
  CXX    thread.o
  CXX    tic6x-linux-tdep.o
  CXX    tic6x-tdep.o
  CXX    tid-parse.o
  CXX    tilegx-linux-tdep.o
  CXX    tilegx-tdep.o
  CXX    top.o
  CXX    tracefile-tfile.o
  CXX    tracefile.o
  CXX    tracepoint.o
  CXX    trad-frame.o
  CXX    tramp-frame.o
  CXX    tui/tui-command.o
  CXX    tui/tui-data.o
  CXX    tui/tui-disasm.o
  CXX    tui/tui-file.o
  CXX    tui/tui-hooks.o
  CXX    tui/tui-interp.o
  CXX    tui/tui-io.o
  CXX    tui/tui-layout.o
  CXX    tui/tui-out.o
  CXX    tui/tui-regs.o
../../binutils-gdb/gdb/tui/tui-layout.c: In function void show_data(tui_layout_type):
../../binutils-gdb/gdb/tui/tui-layout.c:682:72: error: no matching function for call to tui_win_info::reset(int&, int, int, int)
  682 |     tui_win_list[DATA_WIN]->reset (data_height, tui_term_width (), 0, 0);
      |                                                                        ^
In file included from ../../binutils-gdb/gdb/tui/tui-layout.c:31:
../../binutils-gdb/gdb/tui/tui-data.h:64:16: note: candidate: virtual void tui_gen_win_info::reset(tui_win_type, int, int, int, int)
   64 |   virtual void reset (enum tui_win_type win_type,
      |                ^~~~~
../../binutils-gdb/gdb/tui/tui-data.h:64:16: note:   candidate expects 5 arguments, 4 provided
  CXX    tui/tui-source.o
make[2]: *** [Makefile:1634: tui/tui-layout.o] Error 1
make[2]: *** Waiting for unfinished jobs....
make[2]: Leaving directory '/home/gdb-buildbot/fedora-x86-64-3/fedora-x86-64-cc-with-index/build/gdb'
make[1]: *** [Makefile:9230: all-gdb] Error 2
make: *** [Makefile:852: all] Error 2
make[1]: Leaving directory '/home/gdb-buildbot/fedora-x86-64-3/fedora-x86-64-cc-with-index/build'
program finished with exit code 2
elapsedTime=370.206573
Reply | Threaded
Open this post in threaded view
|

Breakage on builder Fedora-x86_64-m32, revision 098f9ed48e1c94a2624c825ba93d72b163d41196

gdb-buildbot
In reply to this post by gdb-buildbot
Unfortunately it seems that there is a breakage on GDB.

Commit title: 'Always create an execution info window for a source window'
Revision: 098f9ed48e1c94a2624c825ba93d72b163d41196

You can find more details below:

+-+-+-+-+-+-+-+-+-+-+-+-+-+-+-+-+-+-+-+


+++ The full log is too big to be posted here.
+++ These are the last 100 lines of it.

  CXX    rx-tdep.o
  CXX    s12z-tdep.o
  CXX    s390-linux-tdep.o
  CXX    s390-tdep.o
  CXX    score-tdep.o
  CXX    selftest-arch.o
  CXX    sentinel-frame.o
  CXX    ser-base.o
  CXX    ser-event.o
  CXX    ser-pipe.o
  CXX    ser-tcp.o
  CXX    ser-uds.o
  CXX    ser-unix.o
  CXX    serial.o
  CXX    sh-linux-tdep.o
  CXX    sh-nbsd-tdep.o
  CXX    sh-tdep.o
  CXX    skip.o
  CXX    sol2-tdep.o
  CXX    solib-aix.o
  CXX    solib-darwin.o
  CXX    solib-dsbt.o
  CXX    solib-frv.o
  CXX    solib-spu.o
  CXX    solib-svr4.o
  CXX    solib-target.o
  CXX    solib.o
  CXX    source-cache.o
  CXX    source.o
  CXX    sparc-linux-tdep.o
  CXX    sparc-nbsd-tdep.o
  CXX    sparc-obsd-tdep.o
  CXX    sparc-ravenscar-thread.o
  CXX    sparc-sol2-tdep.o
  CXX    sparc-tdep.o
  CXX    sparc64-fbsd-tdep.o
  CXX    sparc64-linux-tdep.o
  CXX    sparc64-nbsd-tdep.o
  CXX    sparc64-obsd-tdep.o
  CXX    sparc64-sol2-tdep.o
  CXX    sparc64-tdep.o
  CXX    spu-multiarch.o
  CXX    spu-tdep.o
  CXX    stabsread.o
  CXX    stack.o
  CXX    stap-probe.o
  CXX    std-regs.o
  CXX    symfile-debug.o
  CXX    symfile-mem.o
  CXX    symfile.o
  CXX    symmisc.o
  CXX    symtab.o
  CXX    target-dcache.o
  CXX    target-descriptions.o
  CXX    target-float.o
  CXX    target-memory.o
  CXX    target.o
  CXX    target/waitstatus.o
  CXX    test-target.o
  CXX    thread-iter.o
  CXX    thread.o
  CXX    tic6x-linux-tdep.o
  CXX    tic6x-tdep.o
  CXX    tid-parse.o
  CXX    tilegx-linux-tdep.o
  CXX    tilegx-tdep.o
  CXX    top.o
  CXX    tracefile-tfile.o
  CXX    tracefile.o
  CXX    tracepoint.o
  CXX    trad-frame.o
  CXX    tramp-frame.o
  CXX    tui/tui-command.o
  CXX    tui/tui-data.o
  CXX    tui/tui-disasm.o
  CXX    tui/tui-file.o
  CXX    tui/tui-hooks.o
  CXX    tui/tui-interp.o
  CXX    tui/tui-io.o
  CXX    tui/tui-layout.o
  CXX    tui/tui-out.o
  CXX    tui/tui-regs.o
../../binutils-gdb/gdb/tui/tui-layout.c: In function void show_data(tui_layout_type):
../../binutils-gdb/gdb/tui/tui-layout.c:682:72: error: no matching function for call to tui_win_info::reset(int&, int, int, int)
  682 |     tui_win_list[DATA_WIN]->reset (data_height, tui_term_width (), 0, 0);
      |                                                                        ^
In file included from ../../binutils-gdb/gdb/tui/tui-layout.c:31:
../../binutils-gdb/gdb/tui/tui-data.h:64:16: note: candidate: virtual void tui_gen_win_info::reset(tui_win_type, int, int, int, int)
   64 |   virtual void reset (enum tui_win_type win_type,
      |                ^~~~~
../../binutils-gdb/gdb/tui/tui-data.h:64:16: note:   candidate expects 5 arguments, 4 provided
make[2]: *** [Makefile:1634: tui/tui-layout.o] Error 1
make[2]: *** Waiting for unfinished jobs....
make[2]: Leaving directory '/home/gdb-buildbot-2/fedora-x86-64-4/fedora-x86-64-m32/build/gdb'
make[1]: *** [Makefile:9230: all-gdb] Error 2
make[1]: Leaving directory '/home/gdb-buildbot-2/fedora-x86-64-4/fedora-x86-64-m32/build'
make: *** [Makefile:852: all] Error 2
program finished with exit code 2
elapsedTime=428.248551
Reply | Threaded
Open this post in threaded view
|

Breakage on builder Fedora-x86_64-m64, revision 098f9ed48e1c94a2624c825ba93d72b163d41196

gdb-buildbot
In reply to this post by gdb-buildbot
Unfortunately it seems that there is a breakage on GDB.

Commit title: 'Always create an execution info window for a source window'
Revision: 098f9ed48e1c94a2624c825ba93d72b163d41196

You can find more details below:

+-+-+-+-+-+-+-+-+-+-+-+-+-+-+-+-+-+-+-+


+++ The full log is too big to be posted here.
+++ These are the last 100 lines of it.

  CXX    s12z-tdep.o
  CXX    s390-linux-tdep.o
  CXX    s390-tdep.o
  CXX    score-tdep.o
  CXX    selftest-arch.o
  CXX    sentinel-frame.o
  CXX    ser-base.o
  CXX    ser-event.o
  CXX    ser-pipe.o
  CXX    ser-tcp.o
  CXX    ser-uds.o
  CXX    ser-unix.o
  CXX    serial.o
  CXX    sh-linux-tdep.o
  CXX    sh-nbsd-tdep.o
  CXX    sh-tdep.o
  CXX    skip.o
  CXX    sol2-tdep.o
  CXX    solib-aix.o
  CXX    solib-darwin.o
  CXX    solib-dsbt.o
  CXX    solib-frv.o
  CXX    solib-spu.o
  CXX    solib-svr4.o
  CXX    solib-target.o
  CXX    solib.o
  CXX    source-cache.o
  CXX    source.o
  CXX    sparc-linux-tdep.o
  CXX    sparc-nbsd-tdep.o
  CXX    sparc-obsd-tdep.o
  CXX    sparc-ravenscar-thread.o
  CXX    sparc-sol2-tdep.o
  CXX    sparc-tdep.o
  CXX    sparc64-fbsd-tdep.o
  CXX    sparc64-linux-tdep.o
  CXX    sparc64-nbsd-tdep.o
  CXX    sparc64-obsd-tdep.o
  CXX    sparc64-sol2-tdep.o
  CXX    sparc64-tdep.o
  CXX    spu-multiarch.o
  CXX    spu-tdep.o
  CXX    stabsread.o
  CXX    stack.o
  CXX    stap-probe.o
  CXX    std-regs.o
  CXX    symfile-debug.o
  CXX    symfile-mem.o
  CXX    symfile.o
  CXX    symmisc.o
  CXX    symtab.o
  CXX    target-dcache.o
  CXX    target-descriptions.o
  CXX    target-float.o
  CXX    target-memory.o
  CXX    target.o
  CXX    target/waitstatus.o
  CXX    test-target.o
  CXX    thread-iter.o
  CXX    thread.o
  CXX    tic6x-linux-tdep.o
  CXX    tic6x-tdep.o
  CXX    tid-parse.o
  CXX    tilegx-linux-tdep.o
  CXX    tilegx-tdep.o
  CXX    top.o
  CXX    tracefile-tfile.o
  CXX    tracefile.o
  CXX    tracepoint.o
  CXX    trad-frame.o
  CXX    tramp-frame.o
  CXX    tui/tui-command.o
  CXX    tui/tui-data.o
  CXX    tui/tui-disasm.o
  CXX    tui/tui-file.o
  CXX    tui/tui-hooks.o
  CXX    tui/tui-interp.o
  CXX    tui/tui-io.o
  CXX    tui/tui-layout.o
  CXX    tui/tui-out.o
  CXX    tui/tui-regs.o
../../binutils-gdb/gdb/tui/tui-layout.c: In function void show_data(tui_layout_type):
../../binutils-gdb/gdb/tui/tui-layout.c:682:72: error: no matching function for call to tui_win_info::reset(int&, int, int, int)
  682 |     tui_win_list[DATA_WIN]->reset (data_height, tui_term_width (), 0, 0);
      |                                                                        ^
In file included from ../../binutils-gdb/gdb/tui/tui-layout.c:31:
../../binutils-gdb/gdb/tui/tui-data.h:64:16: note: candidate: virtual void tui_gen_win_info::reset(tui_win_type, int, int, int, int)
   64 |   virtual void reset (enum tui_win_type win_type,
      |                ^~~~~
../../binutils-gdb/gdb/tui/tui-data.h:64:16: note:   candidate expects 5 arguments, 4 provided
  CXX    tui/tui-source.o
make[2]: *** [Makefile:1634: tui/tui-layout.o] Error 1
make[2]: *** Waiting for unfinished jobs....
make[2]: Leaving directory '/home/gdb-buildbot/fedora-x86-64-3/fedora-x86-64/build/gdb'
make[1]: Leaving directory '/home/gdb-buildbot/fedora-x86-64-3/fedora-x86-64/build'
make[1]: *** [Makefile:9230: all-gdb] Error 2
make: *** [Makefile:852: all] Error 2
program finished with exit code 2
elapsedTime=419.040906
Reply | Threaded
Open this post in threaded view
|

Breakage on builder Fedora-x86_64-native-extended-gdbserver-m32, revision 098f9ed48e1c94a2624c825ba93d72b163d41196

gdb-buildbot
In reply to this post by gdb-buildbot
Unfortunately it seems that there is a breakage on GDB.

Commit title: 'Always create an execution info window for a source window'
Revision: 098f9ed48e1c94a2624c825ba93d72b163d41196

You can find more details below:

+-+-+-+-+-+-+-+-+-+-+-+-+-+-+-+-+-+-+-+


+++ The full log is too big to be posted here.
+++ These are the last 100 lines of it.

  CXX    rust-lang.o
  CXX    rx-tdep.o
  CXX    s12z-tdep.o
  CXX    s390-linux-tdep.o
  CXX    s390-tdep.o
  CXX    score-tdep.o
  CXX    selftest-arch.o
  CXX    sentinel-frame.o
  CXX    ser-base.o
  CXX    ser-event.o
  CXX    ser-pipe.o
  CXX    ser-tcp.o
  CXX    ser-uds.o
  CXX    ser-unix.o
  CXX    serial.o
  CXX    sh-linux-tdep.o
  CXX    sh-nbsd-tdep.o
  CXX    sh-tdep.o
  CXX    skip.o
  CXX    sol2-tdep.o
  CXX    solib-aix.o
  CXX    solib-darwin.o
  CXX    solib-dsbt.o
  CXX    solib-frv.o
  CXX    solib-spu.o
  CXX    solib-svr4.o
  CXX    solib-target.o
  CXX    solib.o
  CXX    source-cache.o
  CXX    source.o
  CXX    sparc-linux-tdep.o
  CXX    sparc-nbsd-tdep.o
  CXX    sparc-obsd-tdep.o
  CXX    sparc-ravenscar-thread.o
  CXX    sparc-sol2-tdep.o
  CXX    sparc-tdep.o
  CXX    sparc64-fbsd-tdep.o
  CXX    sparc64-linux-tdep.o
  CXX    sparc64-nbsd-tdep.o
  CXX    sparc64-obsd-tdep.o
  CXX    sparc64-sol2-tdep.o
  CXX    sparc64-tdep.o
  CXX    spu-multiarch.o
  CXX    spu-tdep.o
  CXX    stabsread.o
  CXX    stack.o
  CXX    stap-probe.o
  CXX    std-regs.o
  CXX    symfile-debug.o
  CXX    symfile-mem.o
  CXX    symfile.o
  CXX    symmisc.o
  CXX    symtab.o
  CXX    target-dcache.o
  CXX    target-descriptions.o
  CXX    target-float.o
  CXX    target-memory.o
  CXX    target.o
  CXX    target/waitstatus.o
  CXX    test-target.o
  CXX    thread-iter.o
  CXX    thread.o
  CXX    tic6x-linux-tdep.o
  CXX    tic6x-tdep.o
  CXX    tid-parse.o
  CXX    tilegx-linux-tdep.o
  CXX    tilegx-tdep.o
  CXX    top.o
  CXX    tracefile-tfile.o
  CXX    tracefile.o
  CXX    tracepoint.o
  CXX    trad-frame.o
  CXX    tramp-frame.o
  CXX    tui/tui-command.o
  CXX    tui/tui-data.o
  CXX    tui/tui-disasm.o
  CXX    tui/tui-file.o
  CXX    tui/tui-hooks.o
  CXX    tui/tui-interp.o
  CXX    tui/tui-io.o
  CXX    tui/tui-layout.o
  CXX    tui/tui-out.o
../../binutils-gdb/gdb/tui/tui-layout.c: In function void show_data(tui_layout_type):
../../binutils-gdb/gdb/tui/tui-layout.c:682:72: error: no matching function for call to tui_win_info::reset(int&, int, int, int)
  682 |     tui_win_list[DATA_WIN]->reset (data_height, tui_term_width (), 0, 0);
      |                                                                        ^
In file included from ../../binutils-gdb/gdb/tui/tui-layout.c:31:
../../binutils-gdb/gdb/tui/tui-data.h:64:16: note: candidate: virtual void tui_gen_win_info::reset(tui_win_type, int, int, int, int)
   64 |   virtual void reset (enum tui_win_type win_type,
      |                ^~~~~
../../binutils-gdb/gdb/tui/tui-data.h:64:16: note:   candidate expects 5 arguments, 4 provided
make[2]: *** [Makefile:1634: tui/tui-layout.o] Error 1
make[2]: *** Waiting for unfinished jobs....
make[2]: Leaving directory '/home/gdb-buildbot-2/fedora-x86-64-4/fedora-x86-64-native-extended-gdbserver-m32/build/gdb'
make[1]: *** [Makefile:9230: all-gdb] Error 2
make[1]: Leaving directory '/home/gdb-buildbot-2/fedora-x86-64-4/fedora-x86-64-native-extended-gdbserver-m32/build'
make: *** [Makefile:852: all] Error 2
program finished with exit code 2
elapsedTime=420.442075
Reply | Threaded
Open this post in threaded view
|

Breakage on builder Fedora-x86_64-native-extended-gdbserver-m64, revision 098f9ed48e1c94a2624c825ba93d72b163d41196

gdb-buildbot
In reply to this post by gdb-buildbot
Unfortunately it seems that there is a breakage on GDB.

Commit title: 'Always create an execution info window for a source window'
Revision: 098f9ed48e1c94a2624c825ba93d72b163d41196

You can find more details below:

+-+-+-+-+-+-+-+-+-+-+-+-+-+-+-+-+-+-+-+


+++ The full log is too big to be posted here.
+++ These are the last 100 lines of it.

  CXX    s12z-tdep.o
  CXX    s390-linux-tdep.o
  CXX    s390-tdep.o
  CXX    score-tdep.o
  CXX    selftest-arch.o
  CXX    sentinel-frame.o
  CXX    ser-base.o
  CXX    ser-event.o
  CXX    ser-pipe.o
  CXX    ser-tcp.o
  CXX    ser-uds.o
  CXX    ser-unix.o
  CXX    serial.o
  CXX    sh-linux-tdep.o
  CXX    sh-nbsd-tdep.o
  CXX    sh-tdep.o
  CXX    skip.o
  CXX    sol2-tdep.o
  CXX    solib-aix.o
  CXX    solib-darwin.o
  CXX    solib-dsbt.o
  CXX    solib-frv.o
  CXX    solib-spu.o
  CXX    solib-svr4.o
  CXX    solib-target.o
  CXX    solib.o
  CXX    source-cache.o
  CXX    source.o
  CXX    sparc-linux-tdep.o
  CXX    sparc-nbsd-tdep.o
  CXX    sparc-obsd-tdep.o
  CXX    sparc-ravenscar-thread.o
  CXX    sparc-sol2-tdep.o
  CXX    sparc-tdep.o
  CXX    sparc64-fbsd-tdep.o
  CXX    sparc64-linux-tdep.o
  CXX    sparc64-nbsd-tdep.o
  CXX    sparc64-obsd-tdep.o
  CXX    sparc64-sol2-tdep.o
  CXX    sparc64-tdep.o
  CXX    spu-multiarch.o
  CXX    spu-tdep.o
  CXX    stabsread.o
  CXX    stack.o
  CXX    stap-probe.o
  CXX    std-regs.o
  CXX    symfile-debug.o
  CXX    symfile-mem.o
  CXX    symfile.o
  CXX    symmisc.o
  CXX    symtab.o
  CXX    target-dcache.o
  CXX    target-descriptions.o
  CXX    target-float.o
  CXX    target-memory.o
  CXX    target.o
  CXX    target/waitstatus.o
  CXX    test-target.o
  CXX    thread-iter.o
  CXX    thread.o
  CXX    tic6x-linux-tdep.o
  CXX    tic6x-tdep.o
  CXX    tid-parse.o
  CXX    tilegx-linux-tdep.o
  CXX    tilegx-tdep.o
  CXX    top.o
  CXX    tracefile-tfile.o
  CXX    tracefile.o
  CXX    tracepoint.o
  CXX    trad-frame.o
  CXX    tramp-frame.o
  CXX    tui/tui-command.o
  CXX    tui/tui-data.o
  CXX    tui/tui-disasm.o
  CXX    tui/tui-file.o
  CXX    tui/tui-hooks.o
  CXX    tui/tui-interp.o
  CXX    tui/tui-io.o
  CXX    tui/tui-layout.o
  CXX    tui/tui-out.o
../../binutils-gdb/gdb/tui/tui-layout.c: In function void show_data(tui_layout_type):
../../binutils-gdb/gdb/tui/tui-layout.c:682:72: error: no matching function for call to tui_win_info::reset(int&, int, int, int)
  682 |     tui_win_list[DATA_WIN]->reset (data_height, tui_term_width (), 0, 0);
      |                                                                        ^
In file included from ../../binutils-gdb/gdb/tui/tui-layout.c:31:
../../binutils-gdb/gdb/tui/tui-data.h:64:16: note: candidate: virtual void tui_gen_win_info::reset(tui_win_type, int, int, int, int)
   64 |   virtual void reset (enum tui_win_type win_type,
      |                ^~~~~
../../binutils-gdb/gdb/tui/tui-data.h:64:16: note:   candidate expects 5 arguments, 4 provided
  CXX    tui/tui-regs.o
  CXX    tui/tui-source.o
make[2]: *** [Makefile:1634: tui/tui-layout.o] Error 1
make[2]: *** Waiting for unfinished jobs....
make[2]: Leaving directory '/home/gdb-buildbot/fedora-x86-64-3/fedora-x86-64-native-extended-gdbserver/build/gdb'
make[1]: Leaving directory '/home/gdb-buildbot/fedora-x86-64-3/fedora-x86-64-native-extended-gdbserver/build'
make[1]: *** [Makefile:9230: all-gdb] Error 2
make: *** [Makefile:852: all] Error 2
program finished with exit code 2
elapsedTime=420.788947
Reply | Threaded
Open this post in threaded view
|

Breakage on builder Fedora-x86_64-native-gdbserver-m64, revision 098f9ed48e1c94a2624c825ba93d72b163d41196

gdb-buildbot
In reply to this post by gdb-buildbot
Unfortunately it seems that there is a breakage on GDB.

Commit title: 'Always create an execution info window for a source window'
Revision: 098f9ed48e1c94a2624c825ba93d72b163d41196

You can find more details below:

+-+-+-+-+-+-+-+-+-+-+-+-+-+-+-+-+-+-+-+


+++ The full log is too big to be posted here.
+++ These are the last 100 lines of it.

  CXX    rust-lang.o
  CXX    rx-tdep.o
  CXX    s12z-tdep.o
  CXX    s390-linux-tdep.o
  CXX    s390-tdep.o
  CXX    score-tdep.o
  CXX    selftest-arch.o
  CXX    sentinel-frame.o
  CXX    ser-base.o
  CXX    ser-event.o
  CXX    ser-pipe.o
  CXX    ser-tcp.o
  CXX    ser-uds.o
  CXX    ser-unix.o
  CXX    serial.o
  CXX    sh-linux-tdep.o
  CXX    sh-nbsd-tdep.o
  CXX    sh-tdep.o
  CXX    skip.o
  CXX    sol2-tdep.o
  CXX    solib-aix.o
  CXX    solib-darwin.o
  CXX    solib-dsbt.o
  CXX    solib-frv.o
  CXX    solib-spu.o
  CXX    solib-svr4.o
  CXX    solib-target.o
  CXX    solib.o
  CXX    source-cache.o
  CXX    source.o
  CXX    sparc-linux-tdep.o
  CXX    sparc-nbsd-tdep.o
  CXX    sparc-obsd-tdep.o
  CXX    sparc-ravenscar-thread.o
  CXX    sparc-sol2-tdep.o
  CXX    sparc-tdep.o
  CXX    sparc64-fbsd-tdep.o
  CXX    sparc64-linux-tdep.o
  CXX    sparc64-nbsd-tdep.o
  CXX    sparc64-obsd-tdep.o
  CXX    sparc64-sol2-tdep.o
  CXX    sparc64-tdep.o
  CXX    spu-multiarch.o
  CXX    spu-tdep.o
  CXX    stabsread.o
  CXX    stack.o
  CXX    stap-probe.o
  CXX    std-regs.o
  CXX    symfile-debug.o
  CXX    symfile-mem.o
  CXX    symfile.o
  CXX    symmisc.o
  CXX    symtab.o
  CXX    target-dcache.o
  CXX    target-descriptions.o
  CXX    target-float.o
  CXX    target-memory.o
  CXX    target.o
  CXX    target/waitstatus.o
  CXX    test-target.o
  CXX    thread-iter.o
  CXX    thread.o
  CXX    tic6x-linux-tdep.o
  CXX    tic6x-tdep.o
  CXX    tid-parse.o
  CXX    tilegx-linux-tdep.o
  CXX    tilegx-tdep.o
  CXX    top.o
  CXX    tracefile-tfile.o
  CXX    tracefile.o
  CXX    tracepoint.o
  CXX    trad-frame.o
  CXX    tramp-frame.o
  CXX    tui/tui-command.o
  CXX    tui/tui-data.o
  CXX    tui/tui-disasm.o
  CXX    tui/tui-file.o
  CXX    tui/tui-hooks.o
  CXX    tui/tui-interp.o
  CXX    tui/tui-io.o
  CXX    tui/tui-layout.o
  CXX    tui/tui-out.o
../../binutils-gdb/gdb/tui/tui-layout.c: In function void show_data(tui_layout_type):
../../binutils-gdb/gdb/tui/tui-layout.c:682:72: error: no matching function for call to tui_win_info::reset(int&, int, int, int)
  682 |     tui_win_list[DATA_WIN]->reset (data_height, tui_term_width (), 0, 0);
      |                                                                        ^
In file included from ../../binutils-gdb/gdb/tui/tui-layout.c:31:
../../binutils-gdb/gdb/tui/tui-data.h:64:16: note: candidate: virtual void tui_gen_win_info::reset(tui_win_type, int, int, int, int)
   64 |   virtual void reset (enum tui_win_type win_type,
      |                ^~~~~
../../binutils-gdb/gdb/tui/tui-data.h:64:16: note:   candidate expects 5 arguments, 4 provided
make[2]: *** [Makefile:1634: tui/tui-layout.o] Error 1
make[2]: *** Waiting for unfinished jobs....
make[2]: Leaving directory '/home/gdb-buildbot-2/fedora-x86-64-4/fedora-x86-64-native-gdbserver/build/gdb'
make[1]: *** [Makefile:9230: all-gdb] Error 2
make[1]: Leaving directory '/home/gdb-buildbot-2/fedora-x86-64-4/fedora-x86-64-native-gdbserver/build'
make: *** [Makefile:852: all] Error 2
program finished with exit code 2
elapsedTime=427.141616
Reply | Threaded
Open this post in threaded view
|

Breakage on builder Fedora-x86_64-native-gdbserver-m32, revision 098f9ed48e1c94a2624c825ba93d72b163d41196

gdb-buildbot
In reply to this post by gdb-buildbot
Unfortunately it seems that there is a breakage on GDB.

Commit title: 'Always create an execution info window for a source window'
Revision: 098f9ed48e1c94a2624c825ba93d72b163d41196

You can find more details below:

+-+-+-+-+-+-+-+-+-+-+-+-+-+-+-+-+-+-+-+


+++ The full log is too big to be posted here.
+++ These are the last 100 lines of it.

  CXX    rx-tdep.o
  CXX    s12z-tdep.o
  CXX    s390-linux-tdep.o
  CXX    s390-tdep.o
  CXX    score-tdep.o
  CXX    selftest-arch.o
  CXX    sentinel-frame.o
  CXX    ser-base.o
  CXX    ser-event.o
  CXX    ser-pipe.o
  CXX    ser-tcp.o
  CXX    ser-uds.o
  CXX    ser-unix.o
  CXX    serial.o
  CXX    sh-linux-tdep.o
  CXX    sh-nbsd-tdep.o
  CXX    sh-tdep.o
  CXX    skip.o
  CXX    sol2-tdep.o
  CXX    solib-aix.o
  CXX    solib-darwin.o
  CXX    solib-dsbt.o
  CXX    solib-frv.o
  CXX    solib-spu.o
  CXX    solib-svr4.o
  CXX    solib-target.o
  CXX    solib.o
  CXX    source-cache.o
  CXX    source.o
  CXX    sparc-linux-tdep.o
  CXX    sparc-nbsd-tdep.o
  CXX    sparc-obsd-tdep.o
  CXX    sparc-ravenscar-thread.o
  CXX    sparc-sol2-tdep.o
  CXX    sparc-tdep.o
  CXX    sparc64-fbsd-tdep.o
  CXX    sparc64-linux-tdep.o
  CXX    sparc64-nbsd-tdep.o
  CXX    sparc64-obsd-tdep.o
  CXX    sparc64-sol2-tdep.o
  CXX    sparc64-tdep.o
  CXX    spu-multiarch.o
  CXX    spu-tdep.o
  CXX    stabsread.o
  CXX    stack.o
  CXX    stap-probe.o
  CXX    std-regs.o
  CXX    symfile-debug.o
  CXX    symfile-mem.o
  CXX    symfile.o
  CXX    symmisc.o
  CXX    symtab.o
  CXX    target-dcache.o
  CXX    target-descriptions.o
  CXX    target-float.o
  CXX    target-memory.o
  CXX    target.o
  CXX    target/waitstatus.o
  CXX    test-target.o
  CXX    thread-iter.o
  CXX    thread.o
  CXX    tic6x-linux-tdep.o
  CXX    tic6x-tdep.o
  CXX    tid-parse.o
  CXX    tilegx-linux-tdep.o
  CXX    tilegx-tdep.o
  CXX    top.o
  CXX    tracefile-tfile.o
  CXX    tracefile.o
  CXX    tracepoint.o
  CXX    trad-frame.o
  CXX    tramp-frame.o
  CXX    tui/tui-command.o
  CXX    tui/tui-data.o
  CXX    tui/tui-disasm.o
  CXX    tui/tui-file.o
  CXX    tui/tui-hooks.o
  CXX    tui/tui-interp.o
  CXX    tui/tui-io.o
  CXX    tui/tui-layout.o
  CXX    tui/tui-out.o
  CXX    tui/tui-regs.o
../../binutils-gdb/gdb/tui/tui-layout.c: In function void show_data(tui_layout_type):
../../binutils-gdb/gdb/tui/tui-layout.c:682:72: error: no matching function for call to tui_win_info::reset(int&, int, int, int)
  682 |     tui_win_list[DATA_WIN]->reset (data_height, tui_term_width (), 0, 0);
      |                                                                        ^
In file included from ../../binutils-gdb/gdb/tui/tui-layout.c:31:
../../binutils-gdb/gdb/tui/tui-data.h:64:16: note: candidate: virtual void tui_gen_win_info::reset(tui_win_type, int, int, int, int)
   64 |   virtual void reset (enum tui_win_type win_type,
      |                ^~~~~
../../binutils-gdb/gdb/tui/tui-data.h:64:16: note:   candidate expects 5 arguments, 4 provided
make[2]: *** [Makefile:1634: tui/tui-layout.o] Error 1
make[2]: *** Waiting for unfinished jobs....
make[2]: Leaving directory '/home/gdb-buildbot/fedora-x86-64-1/fedora-x86-64-native-gdbserver-m32/build/gdb'
make[1]: Leaving directory '/home/gdb-buildbot/fedora-x86-64-1/fedora-x86-64-native-gdbserver-m32/build'
make[1]: *** [Makefile:9230: all-gdb] Error 2
make: *** [Makefile:852: all] Error 2
program finished with exit code 2
elapsedTime=655.806634